program: Gaussian 09
title: 000036893
version: EM64L-G09RevD.01
frameworkgroup: C1[X(C12H18N3O)]
method: RPBEPBE
basis: SDD
operation: Freq
keyword: #p
keyword: freq=noraman
keyword: PBEPBE/SDD
title: #p freq=noraman PBEPBE/SDD
converged: YES YES NO NO
title: Mulliken charges:
elementType: O N N N C C C C C C C C C C C C H H H H H H H H H H H H H H H H H H
charge: -0.263289 -0.137230 -0.377376 -0.101277 0.300582 0.251948 -0.236482 -0.368043 -0.256980 -0.056652 -0.285732 -0.302175 -0.196793 -0.181911 -0.613261 -0.611707 0.222375 0.235486 0.211176 0.234021 0.230072 0.214044 0.312484 0.375033 0.273601 0.268962 0.261528 0.264552 0.229252 0.205495 0.237293 0.243676 0.207658 0.209670
chargesum: 1.00000
title: Mulliken charges with hydrogens summed into heavy atoms:
elementType: O N N N C C C C C C C C C C C C
charge: -0.263289 -0.137230 -0.002343 -0.101277 0.300582 0.251948 0.221378 0.077154 0.187136 0.255832 -0.012132 -0.033213 0.064735 0.082642 0.058780 0.049298
polarizability: 3.61124077e+02 1.30806411e+01 1.68244075e+02 -1.09786675e+01 -2.37138772e+00 9.82768969e+01
1716.lowfreq: -8.0165 -0.8160 -0.0001 0.0003 0.0004 5.1799 12.2857 19.8630 37.1279
frequency: 11.2173 19.8017 37.1199 57.6362 78.5414 105.4525 121.1166 177.5460 200.6463 214.6402 218.2797 242.1346 264.6857 290.4196 361.7305 399.2066 415.8372 423.4310 460.6414 484.5081 533.5472 566.9394 592.5427 630.3497 689.7990 742.6202 756.2433 763.9157 766.2078 799.3809 814.3276 828.5057 862.8174 876.9714 909.9544 956.5257 1001.9244 1010.5763 1016.9339 1035.0068 1038.9606 1043.4546 1054.9124 1076.6495 1088.9092 1089.2213 1124.2414 1131.7051 1156.8402 1157.1962 1177.6556 1192.5509 1239.5171 1250.1123 1271.3726 1275.8347 1289.7678 1304.3328 1321.3516 1345.7257 1368.8414 1404.9537 1405.9306 1423.4495 1425.5218 1445.6514 1458.5619 1461.4973 1467.3603 1472.1998 1475.2031 1480.3361 1482.0551 1489.2044 1495.1593 1538.4774 1617.2436 1629.3019 2880.6362 2888.7376 2908.8627 2949.8671 2965.5712 2998.5170 3030.2842 3032.4362 3033.3985 3063.3410 3085.0116 3090.2563 3161.4902 3170.7954 3183.0665 3193.1772 3264.4173 3578.3922
redmass: 3.0989 3.5183 3.9064 3.3990 2.4718 3.6671 3.4654 3.7319 1.1304 1.2223 3.6787 2.7873 2.5542 4.1015 2.7848 3.0027 2.8918 2.5748 3.4427 3.6709 6.0250 3.4780 4.2062 4.2719 1.1722 4.6876 4.4806 1.2856 5.2364 1.3842 2.5257 1.5274 1.4155 5.4103 7.3185 1.3669 1.3513 2.1030 5.8395 2.1675 1.5780 2.1987 1.6150 2.9720 3.0443 1.3024 1.5683 1.5257 1.3156 1.2684 1.1728 1.1777 2.3663 1.6970 1.4734 2.6139 1.3482 2.8958 1.4067 1.6810 1.3320 2.9972 1.3902 3.5884 1.1896 1.1505 2.4138 1.0481 1.0996 1.0671 1.0553 1.2011 1.1566 1.0558 1.9253 4.2218 7.1419 7.1278 1.0546 1.0554 1.0687 1.0544 1.0568 1.1092 1.0789 1.0994 1.0768 1.0968 1.1008 1.1009 1.0881 1.0917 1.0970 1.1002 1.1022 1.0833
irintensity: 0.8774 0.0865 0.7177 4.6529 8.8548 8.6106 1.4046 4.2526 0.4115 0.9596 13.3690 1.1498 24.5640 2.4714 14.4677 1.0289 12.2776 1.7891 4.3868 0.4228 3.2162 2.4401 0.8406 6.3766 103.9621 1.3583 1.8771 142.9929 8.0917 10.9989 16.9381 0.2589 0.7076 0.3759 34.3132 1.8553 0.1799 2.7247 43.8180 25.2919 20.2055 51.8047 8.9262 36.0018 5.1798 10.0895 102.4878 63.7973 6.3180 9.0573 2.0479 4.7745 41.9690 11.8615 16.2178 11.0739 15.0521 6.0958 14.9342 2.0010 8.5998 115.2515 9.6338 5.8639 2.9462 6.5648 41.6546 5.4571 28.5763 11.3740 49.9880 4.4559 12.1365 8.1694 4.9484 33.1572 28.5134 10.8397 79.0988 221.5746 102.3565 37.4028 43.5385 22.1273 32.1133 20.2974 49.8986 28.4228 24.9111 37.6655 0.6146 1.1461 1.0990 0.4634 54.3606 290.4638
temp: 298.150 k
press: 1.00000 atm
elementType: 8 7 7 7 6 6 6 6 6 6 6 6 6 6 6 6 1 1 1 1 1 1 1 1 1 1 1 1 1 1 1 1 1 1
symmnumber: 1
zpe: 755975.3 jmol-1
zpe.correction: 0.287936 hartree
zpe.thermalcorrener: 0.304057 hartree
zpe.thermalcorrenthalpy: 0.305001 hartree
zpe.thermalcorrgfe: 0.240973 hartree
zpe.sumelectzpe: -706.086475 hartree
zpe.sumelectthermal: -706.070354 hartree
zpe.sumelectthermalent: -706.069410 hartree
zpe.sumelectthermalfe: -706.133438 hartree
dipole: -7.7941 -3.6477 -0.4696
dipole: 8.6182
quadrupole: -33.0161 -64.0693 -90.8952
quadrupole: 10.9997 -6.8547 -1.9691
quadrupole: 29.6441 -1.4091 -28.2350 10.9997 -6.8547 -1.9691
hfenergy: -706.3744106 hartree
pointgroup: C01 [X(C12H18N3O1)]
dipole: 2.9751271 1.6099713 -0.2306937 debye
polarizability: 358.7448243|25.0050495|170.6530894|11.0847965|0.4773606|98.2471351 unknown
InChI: InChI=1S/C12H18N3O/c1-14(2)7-8-16-10-15-9-13-11-5-3-4-6-12(11)15/h3-6,9,13H,7-8,10H2,1-2H3
charge 1 multiplicity 1
34 atoms
O  -1.150176 0.603738 -0.112207
N  1.069445 1.200204 -0.534142
N  2.936671 1.919667 0.42087
N  -4.737238 -0.439331 0.087676
C  1.857996 0.049084 -0.27059
C  3.064041 0.51369 0.332956
C  -0.288424 1.191564 -1.106768
C  -3.364778 -0.172422 0.559338
C  -2.55052 0.423202 -0.600538
C  1.737288 2.300814 -0.095953
C  1.624115 -1.321051 -0.499077
C  4.094356 -0.367011 0.717735
C  2.65441 -2.202964 -0.117971
C  3.865232 -1.736121 0.476096
C  -5.799449 -0.117675 1.063234
C  -4.909976 -1.768639 -0.532457
H  -0.56805 2.238432 -1.349674
H  -0.269358 0.59656 -2.044957
H  -2.84893 -1.08207 0.946851
H  -3.391191 0.560724 1.384446
H  -2.976328 1.401152 -0.89912
H  -2.547522 -0.253576 -1.47996
H  1.368487 3.321302 -0.149606
H  3.630129 2.560292 0.810587
H  0.68814 -1.686326 -0.92778
H  5.021524 -0.017774 1.18051
H  2.521055 -3.277658 -0.273061
H  4.633334 -2.462738 0.756604
H  -5.688119 0.922948 1.414051
H  -5.802474 -0.790003 1.955149
H  -6.78475 -0.202737 0.572379
H  -5.901432 -1.826922 -1.013899
H  -4.832598 -2.606105 0.20355
H  -4.150609 -1.932948 -1.317773
