program: Gaussian 09
title: 000036849
version: EM64L-G09RevD.01
frameworkgroup: C1[X(C9H10N2O)]
method: RPBEPBE
basis: SDD
operation: Freq
keyword: #p
keyword: freq=noraman
keyword: PBEPBE/SDD
title: #p freq=noraman PBEPBE/SDD
converged: NO YES NO NO
title: Mulliken charges:
elementType: O N N C C C C C C C C C H H H H H H H H H H
charge: -0.277254 -0.230125 -0.098195 0.298193 0.203181 0.172157 -0.349280 -0.640971 -0.346282 -0.218054 -0.222662 -0.670484 0.241221 0.232909 0.282837 0.232227 0.250161 0.225203 0.229286 0.233082 0.226432 0.226418
chargesum: 0.00000
title: Mulliken charges with hydrogens summed into heavy atoms:
elementType: O N N C C C C C C C C C
charge: -0.277254 -0.230125 -0.098195 0.298193 0.203181 0.172157 -0.108059 0.107002 -0.096120 0.007149 0.006625 0.015447
polarizability: 1.81476526e+02 -4.23371085e-01 1.15149684e+02 -1.64254149e-02 2.45407444e-02 5.50352560e+01
1716.lowfreq: -65.4423 0.0004 0.0008 0.0010 2.4358 8.0323 10.0711 93.0645 125.7673
frequency: -65.4407 93.0602 125.7593 134.0986 145.5133 200.4718 237.3518 270.7097 320.3454 347.0833 425.3464 473.6726 552.5480 564.0854 612.9291 633.9374 641.1421 705.8993 729.7797 743.9240 813.2656 842.9174 854.0467 914.5995 956.9321 962.8633 1009.1868 1048.9997 1070.1364 1083.5649 1121.7748 1128.6928 1137.5636 1164.1050 1195.7883 1260.1738 1314.7647 1352.1944 1418.4088 1422.4756 1430.9231 1453.6280 1465.3860 1478.1602 1483.1570 1485.0341 1488.0194 1615.8299 1628.7189 1741.8864 2950.7364 2977.0431 3024.4001 3057.8284 3086.2777 3112.9118 3137.2523 3154.4155 3167.1608 3180.8268
redmass: 1.0157 4.6815 3.1288 1.0239 3.1338 4.2759 2.8867 6.0059 5.2660 4.3722 3.1680 6.7443 5.4959 4.0336 5.4436 7.5126 10.3996 6.6806 4.8079 1.2269 6.5930 1.3696 4.9522 1.3784 8.0587 1.2909 2.0485 2.7453 3.3969 1.3049 1.5108 1.2965 1.5123 1.1834 2.2803 1.8395 2.3636 4.8153 2.9765 1.2202 1.3044 2.4333 1.0582 1.0443 1.0771 1.0928 3.8145 7.6079 8.0166 9.9414 1.0360 1.0348 1.0995 1.1024 1.0980 1.0989 1.0859 1.0909 1.0963 1.0986
irintensity: 0.1033 2.0937 6.1106 0.0526 8.0848 5.1439 1.7077 0.0014 1.1302 7.5303 6.1631 2.8383 23.2337 0.1710 0.6932 10.9683 4.4786 7.7195 0.0042 120.6431 63.1084 0.0402 20.7397 5.7791 74.8595 0.0005 21.3294 2.3316 2.7718 0.4384 27.7183 0.1396 20.4484 9.0155 65.7033 22.0856 37.1756 48.0306 24.3535 55.9906 10.7358 8.1765 1.6709 8.0987 28.5832 21.1226 192.3194 61.1526 6.5041 794.9905 109.8194 54.8000 43.0713 31.7480 40.5110 0.2856 3.0766 16.0952 16.4227 7.5343
temp: 298.150 k
press: 1.00000 atm
elementType: 8 7 7 6 6 6 6 6 6 6 6 6 1 1 1 1 1 1 1 1 1 1
symmnumber: 1
zpe: 455476.4 jmol-1
zpe.correction: 0.173482 hartree
zpe.thermalcorrener: 0.183654 hartree
zpe.thermalcorrenthalpy: 0.184598 hartree
zpe.thermalcorrgfe: 0.137889 hartree
zpe.sumelectzpe: -532.800341 hartree
zpe.sumelectthermal: -532.790169 hartree
zpe.sumelectthermalent: -532.789225 hartree
zpe.sumelectthermalfe: -532.835934 hartree
dipole: 1.3454 1.1506 0.0043
dipole: 1.7704
quadrupole: -67.1802 -61.3957 -73.8950
quadrupole: 1.7787 0.0015 0.0001
quadrupole: 0.3101 6.0946 -6.4047 1.7787 0.0015 0.0001
hfenergy: -532.9738233 hartree
pointgroup: C01 [X(C9H10N2O1)]
dipole: -0.5240982 -0.4587441 0.0018875 debye
dipolederiv: -1.4738011 0.1111252 -0.0008344 0.4593065 -0.5042823 0.0004618 -0.0009969 0.0003591 -0.1351189 -1.5413463 0.0851102 -0.0011166 -0.2399813 -0.7733606 0.0023566 -0.0001472 -0.003952 -0.1805728 -1.9019174 -0.3358316 -0.0004273 0.0690447 -0.4337711 0.0002471 -0.0024234 -0.000123 -0.3895317 0.9994639 -0.3218071 0.0002723 -0.7070057 -0.0411393 -0.000059 -0.0000439 0.0013803 0.0637059 0.7987337 0.0580494 0.0002367 0.7169049 -0.016099 0.0005324 -0.0004268 0.000299 0.0521538 2.5791302 0.3087384 0.0014291 -0.1324685 0.8094168 -0.000505 0.0029366 0.0001332 0.1772232 -0.1103244 0.1453954 -0.0000931 -0.1030241 0.0647166 -0.0008817 0.0003168 -0.0004158 -0.2046039 0.0176523 -0.1318124 0.0024011 -0.1131459 0.589957 -0.0041183 0.0027626 -0.0030307 0.2630421 0.0951931 -0.022873 0.0001977 -0.0181524 0.0730508 -0.0000736 0.0001016 -0.0001469 -0.158218 -0.0055716 -0.0450271 -0.0000226 0.206354 0.0634123 0.0001439 -0.0003357 -0.000226 -0.1694118 -0.1842396 0.00855 -0.0002199 -0.1894199 -0.0571502 -0.000217 0.00007 -0.0001067 -0.197998 0.7332945 0.2089209 -0.000053 0.320057 0.2947435 0.0000047 0.0008407 -0.0000411 0.2495525 0.0965862 0.0193359 -0.0000306 -0.0068579 -0.0876791 0.0003915 0.0001677 0.0002929 0.1775176 0.0886415 -0.0746893 0.0899189 0.012568 -0.0541596 0.0547818 0.0446708 0.118671 -0.072322 -0.0149475 0.0845556 0.0030059 -0.0239696 0.1517022 0.0014735 0.0021167 0.0008354 0.1289042 0.0851722 -0.0818611 -0.0946224 0.009033 -0.0531731 -0.0547708 -0.0497766 -0.1143201 -0.0639984 0.1046269 -0.027373 -0.0000055 -0.0095577 -0.0542033 0.0000964 0.0000642 0.0000758 0.1784597 -0.0980967 -0.0779364 0.0000194 -0.0863589 0.0489123 0.0000575 0.000023 0.0001316 0.1650636 -0.0749552 0.093948 -0.0000842 0.0920341 0.027201 0.0000954 -0.0000881 0.000099 0.1703559 -0.2250169 -0.0003959 -0.0002105 0.0732141 0.068094 0.0001081 -0.0002987 0.0000762 0.1043364 0.0159994 -0.0018733 0.0605358 -0.1640514 -0.058294 -0.1112522 -0.0431845 -0.1401551 -0.0789984 0.0157227 -0.0022488 -0.0602969 -0.1645228 -0.057895 0.1111267 0.0436511 0.140164 -0.079541 unknown
polarizability: 181.4774737|0.3381284|115.148618|0.0648071|-0.0760983|55.0353739 unknown
InChI: InChI=1S/C9H10N2O/c1-10-9-11(2)7-5-3-4-6-8(7)12-9/h3-6H,1-2H3
charge 0 multiplicity 1
22 atoms
O  0.73523 1.257001 0.001565
N  0.629823 -1.044221 0.001211
N  2.821241 -0.037021 0.003582
C  -0.692272 -0.568776 0.001922
C  -0.625308 0.849617 0.001458
C  1.53887 0.036285 0.002634
C  -1.934453 -1.227504 0.002258
C  1.056481 -2.440679 0.006569
C  -1.757994 1.662007 0.000946
C  -3.099347 -0.414184 0.00174
C  -3.017546 0.998745 0.001023
C  3.654556 1.178674 0.003177
H  -2.006886 -2.319216 0.003333
H  0.703038 -2.958677 0.917412
H  2.157547 -2.448734 -0.011232
H  0.672675 -2.973064 -0.88322
H  -1.677912 2.752312 0.00057
H  -4.083469 -0.895033 0.002023
H  -3.93532 1.595451 0.000637
H  4.714469 0.87746 0.004296
H  3.468072 1.811024 0.894602
H  3.469505 1.809534 -0.889605
