program: Gaussian 09
title: 000036857
version: EM64L-G09RevD.01
frameworkgroup: C1[X(C15H10F3N3O3)]
method: RPBEPBE
basis: SDD
operation: Freq
keyword: #p
keyword: freq=noraman
keyword: PBEPBE/SDD
title: #p freq=noraman PBEPBE/SDD
converged: YES YES NO NO
title: Mulliken charges:
elementType: F F F O O O N N N C C C C C C C C C C C C C C C H H H H H H H H H H
charge: -0.166346 -0.166081 -0.166056 -0.230797 -0.418334 -0.191348 -0.267336 -0.085059 -0.035471 0.045970 0.091370 0.431707 0.132694 -0.448746 0.327507 -0.403418 -0.265554 -0.405212 -0.181169 -0.179673 -0.329729 0.244259 -0.319263 0.162526 0.341043 0.285455 0.275099 0.268078 0.236735 0.236788 0.251587 0.268655 0.268528 0.391591
chargesum: 0.00000
title: Mulliken charges with hydrogens summed into heavy atoms:
elementType: F F F O O O N N N C C C C C C C C C C C C C C C
charge: -0.166346 -0.166081 -0.166056 -0.230797 -0.026742 -0.191348 -0.267336 -0.085059 -0.035471 0.045970 0.091370 0.431707 0.132694 -0.107702 0.327507 -0.117963 0.009545 -0.137134 0.055565 0.057115 -0.078142 0.244259 0.217920 0.162526
polarizability: 2.76293250e+02 -1.96353700e+01 2.54527130e+02 -3.63844366e-02 -2.48911347e-01 8.40553887e+01
1716.lowfreq: -15.7473 -5.4696 -0.0011 -0.0010 -0.0006 1.7052 3.1873 15.9594 22.8287
frequency: -15.4298 15.8405 22.8225 44.0336 46.4865 67.3772 82.2777 112.9404 126.5409 149.6238 171.6238 196.7795 217.1304 230.1752 251.1101 280.8951 303.1481 318.6438 340.4495 387.5266 399.7291 426.3377 430.1997 437.3214 486.6348 502.3306 520.0019 537.3349 570.7810 573.2342 607.9844 610.6932 624.2073 626.2719 644.4153 650.7092 675.8914 702.8592 731.5571 751.5931 778.9866 809.9720 812.2912 825.1500 883.5391 929.3395 945.8702 948.0426 952.8665 977.6385 985.4764 986.3903 988.3271 992.3639 996.5360 1008.6967 1023.3548 1047.7395 1048.6742 1077.3242 1102.2253 1109.4834 1150.8907 1182.5431 1193.9534 1205.0211 1254.9819 1264.7342 1286.1883 1312.9897 1349.6668 1357.2821 1374.1445 1386.1150 1393.8882 1398.9485 1443.9832 1447.7373 1463.1797 1486.3486 1502.7529 1551.4415 1600.9883 1612.0421 1620.0307 1704.1555 3000.3504 3058.3833 3143.3396 3151.0474 3160.1835 3163.1375 3179.5588 3183.7440 3191.9298 3527.7665
redmass: 16.4890 10.2769 9.2614 6.2774 8.5551 5.7207 8.7836 2.6229 7.3258 9.3553 5.0322 8.3152 5.1646 7.4694 6.5732 12.0678 6.9783 6.7081 8.5811 6.5486 8.2547 6.2315 4.5365 5.3883 4.7476 1.7766 10.3832 5.6253 4.5918 8.6459 8.7577 8.6734 1.5707 4.9255 7.5279 7.8102 7.9371 2.2312 10.3028 8.1656 3.2626 1.5526 1.5852 8.0079 4.4526 1.3968 1.3970 7.0778 1.4092 7.5592 6.1835 1.3670 7.2349 1.9704 1.3952 6.1122 2.9911 4.0417 2.5818 3.2053 1.9260 2.4869 1.5989 1.1050 1.0770 3.2329 1.6153 2.5276 2.4231 1.4378 4.0598 2.2810 3.0798 2.4066 5.8960 5.8761 1.2416 2.9575 3.1569 4.0047 4.0922 7.0521 6.9179 7.8590 6.2448 9.4197 1.0568 1.1040 1.0899 1.0885 1.0943 1.0913 1.0939 1.0997 1.0962 1.0643
irintensity: 0.0274 0.9839 0.3409 1.1954 1.1007 1.4188 2.9774 6.1746 0.6466 1.0387 5.4499 2.1604 0.2873 0.2783 0.0018 0.3016 0.0237 3.2614 11.0834 2.9043 4.5918 5.5901 0.0829 0.0197 0.5824 34.0960 0.5757 58.6136 6.1913 3.3904 4.4611 21.5579 130.4665 7.0030 9.9116 10.4060 16.6004 27.1178 69.6540 5.8243 31.1660 0.3521 101.2767 14.4414 7.8507 6.8185 0.9790 26.4249 42.9638 118.2775 18.2572 0.0057 197.5836 0.1191 4.0113 154.0005 42.8292 122.6734 287.2639 7.8803 11.7088 25.7547 49.2156 2.5935 1.0074 10.7675 62.2514 156.0478 159.6552 49.8432 54.1458 21.8805 30.6973 77.6846 57.9688 34.5307 65.2081 178.7950 0.1780 145.6084 402.8495 59.2428 28.0295 94.3359 77.2438 199.2463 26.4286 6.8187 10.3001 9.2104 25.6915 3.0445 2.4146 14.2121 2.4683 40.9609
temp: 298.150 k
press: 1.00000 atm
elementType: 9 9 9 8 8 8 7 7 7 6 6 6 6 6 6 6 6 6 6 6 6 6 6 6 1 1 1 1 1 1 1 1 1 1
symmnumber: 1
zpe: 606562.0 jmol-1
zpe.correction: 0.231027 hartree
zpe.thermalcorrener: 0.250484 hartree
zpe.thermalcorrenthalpy: 0.251429 hartree
zpe.thermalcorrgfe: 0.180259 hartree
zpe.sumelectzpe: -1265.341857 hartree
zpe.sumelectthermal: -1265.322400 hartree
zpe.sumelectthermalent: -1265.321456 hartree
zpe.sumelectthermalfe: -1265.392626 hartree
dipole: -4.9057 -1.5583 0.0160
dipole: 5.1473
quadrupole: -152.5625 -110.1105 -139.4365
quadrupole: 5.7091 0.0154 -0.0370
quadrupole: -18.5260 23.9260 -5.4000 5.7091 0.0154 -0.0370
hfenergy: -1265.5728845 hartree
pointgroup: C01 [X(C15H10F3N3O3)]
dipole: 1.9164031 -0.6544978 -0.0029878 debye
polarizability: 277.0225691|18.8808119|253.0686109|5.2089163|10.4322212|84.7845886 unknown
InChI: InChI=1S/C15H10F3N3O3/c16-15(17,18)9-3-1-4-10(7-9)21-13-11(5-2-6-19-13)14(20-21)24-8-12(22)23/h1-7,22H,8H2
charge 0 multiplicity 1
34 atoms
F  -5.941306 -1.083262 -0.229993
F  -5.027476 0.602972 0.98027
F  -5.006251 0.696519 -1.27859
O  3.648122 0.050887 0.003606
O  5.884172 -2.80987 -0.100312
O  6.351134 -0.528934 0.043076
N  0.112787 0.018864 -0.070205
N  1.358646 -0.657571 -0.084845
N  -0.642724 2.374787 0.049851
C  0.308612 1.403707 0.012372
C  1.727123 1.628036 0.052976
C  -1.085744 -0.746824 -0.142589
C  2.296732 0.309237 -0.010218
C  -2.347884 -0.106104 -0.124003
C  -3.514827 -0.898396 -0.19845
C  -1.001027 -2.160838 -0.23383
C  2.200112 2.95597 0.138426
C  -3.449266 -2.306081 -0.289902
C  -2.180481 -2.925752 -0.306003
C  1.228379 3.976802 0.177483
C  -0.157726 3.644251 0.131368
C  -4.843075 -0.195523 -0.182087
C  4.0106 -1.36854 -0.067923
C  5.527465 -1.454743 -0.031736
H  -2.399417 0.983731 -0.052111
H  -0.017538 -2.634659 -0.246519
H  3.271262 3.174789 0.172556
H  -4.365093 -2.900195 -0.346045
H  -2.110305 -4.015899 -0.375403
H  1.520597 5.028361 0.243494
H  -0.91468 4.435376 0.161934
H  3.577289 -1.927683 0.782677
H  3.625571 -1.825122 -0.999203
H  6.87512 -2.897693 -0.079227
