program: Gaussian 09
title: 000036874
version: EM64L-G09RevD.01
frameworkgroup: C1[X(C14H18ClNO4)]
method: RPBEPBE
basis: SDD
operation: Freq
keyword: #p
keyword: freq=noraman
keyword: PBEPBE/SDD
title: #p freq=noraman PBEPBE/SDD
converged: YES YES NO NO
title: Mulliken charges:
elementType: Cl O O O O N C C C C C C C C C C C C C C H H H H H H H H H H H H H H H H H H
charge: -0.063234 -0.245502 -0.275844 -0.244070 -0.195430 -0.101229 -0.352614 -0.341541 -0.354050 -0.312796 -0.317616 -0.266029 0.229399 -0.394875 0.358876 -0.315331 -0.353762 -0.208507 -0.183986 -0.116977 0.194584 0.213649 0.206506 0.198415 0.201055 0.221065 0.216477 0.194880 0.195956 0.217461 0.236647 0.244735 0.243359 0.242818 0.251211 0.264630 0.253597 0.258073
chargesum: 0.00000
title: Mulliken charges with hydrogens summed into heavy atoms:
elementType: Cl O O O O N C C C C C C C C C C C C C C
charge: -0.063234 -0.245502 -0.275844 -0.244070 -0.195430 -0.101229 0.055619 0.063380 0.068070 0.098560 0.095801 0.215353 0.229399 0.091302 0.358876 -0.064120 -0.089132 0.045090 0.074088 -0.116977
polarizability: 2.72263929e+02 3.25977728e+00 1.64962620e+02 -7.65652147e+00 -5.81598026e-01 1.09362378e+02
1716.lowfreq: -17.0666 -10.0247 -0.0023 -0.0017 -0.0006 3.4087 7.0522 12.8942 20.5188
frequency: -14.0492 11.8464 18.0506 29.9742 38.4735 55.9242 89.0511 111.7013 134.2336 135.9887 149.0238 169.5690 207.1078 237.1601 254.8424 264.3894 315.6923 317.9675 333.1931 374.9125 394.5529 415.7527 416.6380 458.7356 468.1299 498.9450 504.3900 563.0021 597.6433 614.8698 624.0001 695.1237 698.2381 759.5457 789.8155 799.9831 801.1231 813.0146 826.3580 839.6108 890.5272 898.1095 926.0454 932.4806 955.5798 991.5871 1000.7601 1002.2547 1026.1515 1028.2912 1051.4769 1059.4548 1071.6476 1080.7250 1093.9138 1108.1296 1108.8235 1124.8393 1137.1742 1155.5207 1176.1915 1188.8872 1200.7492 1206.7720 1228.1381 1252.3757 1269.4278 1287.0979 1290.1353 1293.7780 1315.2754 1332.4382 1346.1201 1355.0510 1364.6043 1371.2099 1378.7878 1397.4494 1405.0763 1443.8658 1447.0961 1450.8765 1451.2681 1458.3150 1470.6701 1476.8874 1482.9548 1584.9456 1605.9559 1681.1691 2867.1935 2873.8443 2897.0119 2956.4681 2960.5984 2961.4119 3017.9697 3022.1580 3029.0769 3036.4501 3042.7591 3083.3026 3086.4136 3095.8429 3155.3853 3161.8804 3175.0238 3181.6094
redmass: 3.3474 5.1015 7.3572 7.6384 6.2971 4.7231 4.5933 2.9422 5.5893 4.1329 6.2762 3.2183 5.1366 1.9734 3.7829 7.5888 5.0234 3.4003 4.0638 3.2358 2.6435 3.0094 4.7673 5.6779 2.7586 2.7153 5.5715 3.2561 1.9715 7.1101 7.1916 6.0476 3.4663 3.4823 1.3784 5.0257 1.3231 3.1957 1.5197 1.5906 5.8787 2.4888 1.3457 6.4445 1.3435 3.9693 2.6504 1.8803 2.8521 4.0168 2.3335 1.8130 2.5634 2.7934 3.5464 2.0027 1.4679 3.5782 2.5411 1.8860 1.1614 1.0644 1.0777 1.2942 4.7232 1.3301 1.2796 1.2486 1.2595 1.2536 1.3201 1.2538 1.3078 1.8082 1.5263 1.2737 3.1405 1.5076 3.7854 1.0822 1.0797 1.1480 1.0970 1.0976 1.0904 2.0942 1.0867 7.3555 6.7060 10.9429 1.0703 1.0692 1.0695 1.0666 1.0665 1.0554 1.1040 1.0589 1.0900 1.0889 1.0896 1.0962 1.0980 1.1086 1.0878 1.0886 1.0966 1.0978
irintensity: 0.2699 0.5089 0.2913 0.7157 0.0372 0.5107 0.4794 0.9611 2.6571 6.1288 0.7861 11.3195 1.4707 4.4070 13.9936 0.9937 7.4860 6.9371 0.8451 19.8342 6.8932 0.0622 4.9499 3.4489 0.8060 24.3961 2.1081 3.4956 5.0707 14.7439 1.1694 30.5507 0.5369 10.1994 3.5712 5.0496 20.6147 21.9285 72.9485 0.1400 7.1458 5.9788 0.0213 36.7541 0.3464 34.2459 30.9015 0.8709 88.5404 122.8294 20.7057 4.4588 49.4154 14.6685 66.4200 34.6759 29.6368 601.2767 36.2660 11.1739 11.7432 2.3950 1.1539 1.5114 191.0960 17.6623 5.0241 16.8030 0.4904 1.8835 10.9339 2.0676 2.3217 21.1626 5.2113 2.7842 0.0249 4.2396 1.0615 3.0519 0.5307 121.5660 11.2091 3.6334 15.7984 155.2249 15.0413 13.1080 23.3533 182.9474 49.0156 81.6704 105.0983 29.0508 100.8856 44.5955 16.9212 16.1936 36.5809 38.8639 22.8445 39.2227 32.8403 30.5186 11.3886 1.6823 6.4311 0.8801
temp: 298.150 k
press: 1.00000 atm
elementType: 17 8 8 8 8 7 6 6 6 6 6 6 6 6 6 6 6 6 6 6 1 1 1 1 1 1 1 1 1 1 1 1 1 1 1 1 1 1
symmnumber: 1
zpe: 791270.1 jmol-1
zpe.correction: 0.301379 hartree
zpe.thermalcorrener: 0.320394 hartree
zpe.thermalcorrenthalpy: 0.321338 hartree
zpe.thermalcorrgfe: 0.249855 hartree
zpe.sumelectzpe: -1358.421401 hartree
zpe.sumelectthermal: -1358.402386 hartree
zpe.sumelectthermalent: -1358.401441 hartree
zpe.sumelectthermalfe: -1358.472925 hartree
dipole: 2.1658 -2.6766 -0.1829
dipole: 3.4480
quadrupole: -157.5401 -122.6865 -125.0003
quadrupole: -4.4229 -4.5297 4.2248
quadrupole: -22.4644 12.3891 10.0753 -4.4229 -4.5297 4.2248
hfenergy: -1358.7227798 hartree
pointgroup: C01 [X(C14H18Cl1N1O4)]
dipole: 0.8659278 -1.0183261 0.2310294 debye
polarizability: 271.7556475|1.248371|159.4926601|-11.9707165|-16.6943729|115.3406196 unknown
InChI: InChI=1S/C14H18ClNO4/c15-12-1-3-13(4-2-12)20-11-14(17)19-10-7-16-5-8-18-9-6-16/h1-4H,5-11H2
charge 0 multiplicity 1
38 atoms
Cl -8.238802 -0.764524 0.785758
O  7.465495 0.100697 0.445658
O  0.915842 -0.337812 -0.243161
O  -2.532077 0.75412 -0.434273
O  0.005087 1.638102 -1.100378
N  4.659204 -0.375312 -0.133252
C  5.648727 -1.484552 -0.14988
C  5.082714 0.678241 0.827646
C  3.266881 -0.831797 0.081496
C  7.039096 -0.934808 -0.510448
C  6.481977 1.195688 0.456269
C  2.288852 0.145836 -0.581247
C  -0.136159 0.524346 -0.567268
C  -1.436613 -0.156893 -0.148229
C  -3.82958 0.31633 -0.115636
C  -4.139936 -0.938145 0.46544
C  -4.860504 1.239845 -0.420296
C  -5.4891 -1.264579 0.740306
C  -6.202177 0.914167 -0.146652
C  -6.499487 -0.338466 0.431759
H  5.708607 -2.000554 0.841134
H  5.341475 -2.229683 -0.90772
H  4.366828 1.520276 0.797663
H  5.103831 0.282291 1.874317
H  3.009757 -0.939184 1.162856
H  3.142536 -1.827441 -0.381755
H  7.806262 -1.724434 -0.453011
H  7.014228 -0.509492 -1.536907
H  6.446053 1.678507 -0.543975
H  6.850609 1.916679 1.204288
H  2.398439 1.180009 -0.210233
H  2.407727 0.152981 -1.678074
H  -1.539888 -1.107251 -0.711209
H  -1.379262 -0.401166 0.932097
H  -3.361657 -1.666796 0.709593
H  -4.591639 2.200533 -0.868442
H  -5.740788 -2.229887 1.188746
H  -7.002458 1.622227 -0.379478
