program: Gaussian 09
title: 000036927
version: EM64L-G09RevD.01
frameworkgroup: C1[X(C18H24N2)]
method: RPBEPBE
basis: SDD
operation: Freq
keyword: #pfreq=noraman
keyword: PBEPBE/SDD
title: #p freq=noraman PBEPBE/SDD
converged: YES YES NO NO
title: Mulliken charges:
elementType: N N C C C C C C C C C C C C C C C C C C H H H H H H H H H H H H H H H H H H H H H H H H
charge: -0.432068 -0.014213 0.137286 -0.480631 -0.434111 -0.411244 -0.466818 -0.098195 0.238683 0.285287 -0.130543 -0.316871 -0.102852 -0.576451 -0.332401 0.420795 -0.694891 -0.696863 -0.358047 -0.821709 0.232564 0.200536 0.206259 0.203065 0.199971 0.211443 0.239987 0.228382 0.284528 0.204660 0.210092 0.190555 0.195977 0.259399 0.208109 0.214733 0.241558 0.208255 0.219694 0.215141 0.231400 0.219922 0.229789 0.229839
chargesum: 0.00000
title: Mulliken charges with hydrogens summed into heavy atoms:
elementType: N N C C C C C C C C C C C C C C C C C C
charge: -0.147539 -0.014213 0.137286 -0.047531 -0.024788 0.000171 0.001551 -0.098195 0.238683 0.285287 -0.130543 0.097881 0.087703 -0.380474 -0.073002 0.420795 -0.030492 -0.053772 -0.126647 -0.142159
polarizability: 2.90755969e+02 3.68582819e+00 2.38526723e+02 5.92883785e-01 -1.92026524e+01 1.29801522e+02
1716.lowfreq: -13.8634 -9.1475 -0.0004 0.0007 0.0008 3.8627 14.8572 35.9719 47.5834
frequency: 10.9969 35.8414 47.5138 69.2956 81.2244 95.0195 103.1124 143.6328 174.4066 188.1673 192.7122 201.7501 225.9626 238.1166 276.8699 289.8231 311.4648 331.0343 353.1373 366.5588 378.2605 396.9675 430.7689 432.8799 457.9347 487.6747 504.5406 509.8199 546.5030 559.7914 608.2131 613.2615 647.1067 680.2684 695.1437 760.7208 784.2600 814.7175 824.4162 831.5249 834.7550 872.8440 881.1368 890.2284 911.5559 917.2998 921.3336 941.3752 950.4476 962.3526 979.6251 986.3723 1014.6892 1029.9444 1046.1293 1079.0294 1094.2482 1123.4458 1125.6053 1131.8595 1141.1766 1151.3506 1162.5600 1166.5897 1179.9940 1224.7317 1236.9530 1240.1143 1251.2071 1260.1706 1280.0166 1289.5934 1305.3019 1327.3946 1330.3920 1338.0272 1339.6429 1349.0604 1352.4279 1379.1403 1389.9576 1394.7794 1398.3678 1402.3240 1409.2131 1426.5771 1451.1827 1461.0166 1466.5891 1467.5107 1468.3845 1470.9021 1473.5820 1477.3052 1479.4229 1481.7789 1483.2183 1488.4451 1509.6798 1550.6535 1568.9305 1629.8427 2939.9228 2946.9852 2954.9190 2971.0930 2971.7112 2975.1296 2975.3265 2978.0095 2980.0027 3014.2362 3035.8606 3039.6226 3048.3043 3049.2079 3056.2028 3062.7474 3071.1291 3075.6633 3079.0370 3079.2937 3101.7389 3120.3148 3160.2476 3535.6061
redmass: 2.8063 3.1673 3.4813 3.1491 2.7271 1.0730 2.5701 2.8096 3.1475 2.9088 1.2479 2.5339 2.6467 1.2065 2.6473 3.3875 3.1465 2.3347 2.8557 4.2824 2.5867 2.2504 2.4517 3.6297 3.2174 4.0550 2.6006 1.4517 3.8760 3.3487 4.2632 3.9707 4.0996 4.0705 4.1807 5.3415 2.7302 2.9884 3.1677 1.7603 1.4830 1.7106 3.0521 1.8333 1.4994 1.2988 1.6106 1.6122 2.1210 1.6250 1.3355 2.3428 1.8992 3.3859 1.5511 1.8776 1.5572 1.9145 2.3482 1.1821 2.1409 2.0711 1.6000 2.0482 1.8421 2.1996 2.4466 1.3180 1.3649 1.3945 1.5992 1.7345 1.6762 1.7193 1.4952 1.4768 1.4149 1.4809 1.5495 1.2124 3.7571 1.7215 1.2394 2.0053 4.0476 2.4386 1.1385 1.1790 1.0689 1.0514 1.0471 1.1738 1.3978 1.1291 1.3424 1.0663 1.2528 1.0548 2.7513 5.8606 5.0975 6.2921 1.0828 1.0645 1.0671 1.0357 1.0371 1.0554 1.0444 1.0620 1.0651 1.0939 1.0944 1.1006 1.0975 1.1023 1.0957 1.0995 1.0983 1.0996 1.0986 1.0990 1.0890 1.0888 1.0957 1.0744
irintensity: 0.3187 0.4049 0.5421 0.3283 0.1860 0.6001 0.5317 2.0953 0.1931 0.7748 0.3203 0.5238 4.1448 0.2482 1.8844 0.3388 0.1811 1.9834 2.4550 5.2472 2.3484 2.4849 0.9246 1.0183 3.3579 3.2346 8.9654 80.4223 6.3426 15.5550 9.4879 3.1683 7.1265 1.8087 2.1229 3.5400 0.8027 1.5703 5.0031 3.9318 52.4661 0.2783 2.7028 4.4960 6.4266 1.5787 14.1728 1.7725 3.6700 1.5810 1.2740 12.0745 3.0635 11.8637 10.4371 0.1701 0.0457 2.0519 37.5238 0.2309 5.6770 17.9367 8.3644 0.5153 10.8672 5.2602 0.9729 6.9205 1.3819 3.5565 0.9985 1.3405 5.1287 5.2164 9.1437 4.2782 3.5350 10.3160 1.1746 10.6652 10.7079 63.7775 10.5234 52.6907 4.8105 36.5026 29.5458 31.0627 5.6057 7.7159 13.0818 22.6140 55.9138 17.7960 4.0171 7.3241 20.5612 19.3030 191.8504 64.3670 66.3526 3.6112 29.5233 17.9411 95.9298 43.2072 50.0298 26.6178 41.0078 32.5041 14.9908 28.2966 50.7477 57.2326 19.6921 55.9915 10.0203 17.0795 74.4127 21.4835 12.9477 64.6543 31.6468 18.0122 15.5009 9.6072
temp: 298.150 k
press: 1.00000 atm
elementType: 7 7 6 6 6 6 6 6 6 6 6 6 6 6 6 6 6 6 6 6 1 1 1 1 1 1 1 1 1 1 1 1 1 1 1 1 1 1 1 1 1 1 1 1
symmnumber: 1
zpe: 994536.4 jmol-1
zpe.correction: 0.378799 hartree
zpe.thermalcorrener: 0.398453 hartree
zpe.thermalcorrenthalpy: 0.399398 hartree
zpe.thermalcorrgfe: 0.329589 hartree
zpe.sumelectzpe: -808.353285 hartree
zpe.sumelectthermal: -808.333630 hartree
zpe.sumelectthermalent: -808.332686 hartree
zpe.sumelectthermalfe: -808.402495 hartree
dipole: 0.0360 4.1962 -0.7191
dipole: 4.2576
quadrupole: -107.3473 -119.4943 -123.8835
quadrupole: -0.4573 1.3700 -0.4694
quadrupole: 9.5610 -2.5859 -6.9751 -0.4573 1.3700 -0.4694
hfenergy: -808.7320838 hartree
pointgroup: C01 [X(C18H24N2)]
dipole: 0.9061084 -1.3770878 0.297313 debye
polarizability: 278.2552948|22.6216565|250.671343|12.4674061|-15.9741428|130.1575762 unknown
InChI: InChI=1S/C18H24N2/c1-12(2)11-19-18-14-6-4-5-7-16(14)20-17-9-8-13(3)10-15(17)18/h8-10,12,19H,4-7,11H2,1-3H3
charge 0 multiplicity 1
44 atoms
N  1.054745 -1.216593 0.858082
N  -1.086224 2.229518 -0.505956
C  1.030446 1.166386 0.18795
C  2.495662 1.366755 0.573166
C  2.860624 2.849884 0.797421
C  2.411468 3.681879 -0.421311
C  0.873623 3.649012 -0.533885
C  0.250208 2.277019 -0.290745
C  0.375469 -0.077126 0.398738
C  -1.059925 -0.161252 0.177103
C  -1.740292 1.03617 -0.257533
C  2.359472 -1.715696 0.377843
C  2.284995 -3.208084 -0.047584
C  -1.826975 -1.360728 0.348678
C  -3.158352 0.992851 -0.457248
C  -3.213749 -1.392679 0.147196
C  1.404882 -3.40026 -1.304286
C  3.710715 -3.762945 -0.272992
C  -3.876656 -0.184013 -0.25368
C  -4.014454 -2.670289 0.326622
H  2.706886 0.772821 1.483801
H  3.169679 0.972245 -0.21545
H  2.359899 3.232486 1.709375
H  3.951609 2.941294 0.959989
H  2.873646 3.260219 -1.336917
H  2.758524 4.729071 -0.339155
H  0.531538 4.007174 -1.522573
H  0.429777 4.346034 0.2050
H  0.473119 -1.930797 1.299132
H  3.144558 -1.604103 1.155044
H  2.669187 -1.116273 -0.496238
H  1.829342 -3.775528 0.794814
H  -1.331247 -2.300123 0.627098
H  -3.644251 1.920114 -0.777027
H  1.880115 -2.924757 -2.183773
H  1.269184 -4.473152 -1.533555
H  0.40511 -2.946668 -1.178628
H  4.22359 -3.207933 -1.082023
H  3.676422 -4.8273 -0.568069
H  4.328253 -3.681175 0.641015
H  -4.962296 -0.198999 -0.411365
H  -3.370696 -3.518168 0.618522
H  -4.7897 -2.551601 1.107649
H  -4.538527 -2.950493 -0.607044
