program: Gaussian 09
title: 000036835
version: EM64L-G09RevD.01
frameworkgroup: C1[X(C13H18N2O)]
method: RPBEPBE
basis: SDD
operation: Freq
keyword: #p
keyword: freq=noraman
keyword: PBEPBE/SDD
title: #p freq=noraman PBEPBE/SDD
converged: YES YES NO NO
title: Mulliken charges:
elementType: O N N C C C C C C C C C C C C C H H H H H H H H H H H H H H H H H H
charge: -0.312264 -0.238630 -0.505455 -0.075160 -0.003715 -0.487424 -0.493745 -0.697792 -0.717557 0.268570 0.475732 -0.454587 -0.342781 -0.200819 -0.215056 -0.262751 0.217857 0.260416 0.229533 0.229144 0.224363 0.232932 0.218051 0.232963 0.229442 0.270585 0.210458 0.207112 0.309954 0.211033 0.310126 0.221636 0.222525 0.225302
chargesum: 0.00000
title: Mulliken charges with hydrogens summed into heavy atoms:
elementType: O N N C C C C C C C C C C C C C
charge: -0.312264 -0.238630 -0.195500 0.142697 0.256700 -0.028746 -0.036449 -0.017336 -0.029402 0.268570 0.475732 -0.243554 -0.032655 0.020816 0.007469 -0.037449
polarizability: 2.29287627e+02 -5.80622046e-01 1.53177442e+02 5.40406862e-01 1.26556649e+01 9.62083117e+01
1716.lowfreq: -14.3624 -0.0008 -0.0007 -0.0003 3.6437 6.5862 33.2983 45.1269 87.0541
frequency: 33.0059 45.1067 87.0262 92.7512 103.6302 134.6725 177.3500 204.3187 220.8714 240.5634 244.6564 264.8857 317.8414 342.6433 369.6684 398.8672 408.1244 464.4641 503.7099 510.5126 564.7139 582.9133 615.6627 636.6550 695.6973 702.8132 708.7395 763.5385 781.4868 801.9052 836.2563 837.7783 865.4915 911.0862 915.9647 929.1524 960.6004 961.9456 967.4282 983.0157 998.6385 1022.4366 1029.8390 1037.8199 1059.7087 1084.8099 1091.8097 1115.9069 1146.8391 1166.5572 1170.2267 1186.5814 1191.3132 1210.3222 1259.8217 1287.4324 1291.0570 1306.1368 1311.0119 1323.4060 1329.0866 1336.4770 1348.2868 1379.0782 1386.2085 1389.4998 1428.6231 1459.5578 1464.8263 1473.8378 1476.4411 1483.5889 1486.9293 1488.0438 1510.3045 1594.2642 1611.4701 1618.6095 2943.7564 2982.2642 2984.8640 3008.2438 3014.9543 3028.0037 3073.3241 3077.6484 3080.9883 3086.1302 3089.7397 3100.8061 3102.9587 3128.0826 3139.8884 3162.5338 3194.8577 3542.8024
redmass: 3.7026 3.9388 3.0776 3.8581 5.6333 4.1891 2.7608 1.3700 2.1109 1.0984 3.7707 3.0982 2.8663 6.7731 2.4316 2.2376 2.9514 3.5286 2.3410 3.8888 1.3734 5.0246 6.2076 2.2400 1.9863 6.2498 3.4727 1.7005 4.7947 2.1573 4.7615 1.3124 2.7009 1.4271 1.9162 1.4488 1.7814 2.6350 1.3418 6.0494 1.2984 2.4227 1.3492 1.5632 2.2634 1.6069 1.7196 1.4362 2.1314 3.5666 1.0533 1.1160 1.8004 1.6113 1.9760 1.5045 1.5569 1.5035 1.6984 1.3622 1.4724 2.3877 1.2764 1.2470 4.0629 1.3299 2.5497 1.0629 1.0620 1.0754 1.0831 1.0732 1.8866 1.1794 2.2861 7.8024 3.6708 6.2429 1.0845 1.0362 1.0359 1.0657 1.0632 1.0835 1.1007 1.0994 1.0997 1.1022 1.1015 1.0885 1.0994 1.0864 1.0932 1.0998 1.0948 1.0753
irintensity: 0.1755 0.5091 0.4161 1.9016 4.5921 0.0630 0.0767 1.9276 4.8264 0.4239 1.9886 5.3401 0.3118 4.2639 4.3481 1.1250 0.0128 1.5729 41.1794 1.9121 25.6958 12.9058 1.8415 6.0525 38.5246 22.0277 7.6110 91.4955 0.8653 1.7803 0.9359 0.0857 1.6855 11.6467 1.4011 2.9060 0.7943 1.6526 0.1590 1.2335 3.4301 0.4051 3.5550 68.4988 3.1051 12.6314 5.2572 5.1133 4.2441 29.3815 0.2972 2.8718 5.7871 23.6094 91.3370 79.0555 5.8976 9.1751 0.8742 41.7232 26.2501 306.7324 24.9044 44.6828 143.9674 44.3749 143.2577 4.0237 3.6547 3.7190 4.6265 20.8052 49.0775 29.1405 491.1091 85.3713 133.8789 198.7077 35.6144 31.0174 19.5713 17.2517 39.1641 20.7116 8.8454 51.5206 48.1768 36.9506 37.3051 20.4914 14.8490 0.4991 35.2246 28.3485 10.1279 6.9227
temp: 298.150 k
press: 1.00000 atm
elementType: 8 7 7 6 6 6 6 6 6 6 6 6 6 6 6 6 1 1 1 1 1 1 1 1 1 1 1 1 1 1 1 1 1 1
symmnumber: 1
zpe: 756555.3 jmol-1
zpe.correction: 0.288157 hartree
zpe.thermalcorrener: 0.303436 hartree
zpe.thermalcorrenthalpy: 0.304380 hartree
zpe.thermalcorrgfe: 0.245379 hartree
zpe.sumelectzpe: -689.734841 hartree
zpe.sumelectthermal: -689.719563 hartree
zpe.sumelectthermalent: -689.718618 hartree
zpe.sumelectthermalfe: -689.777619 hartree
dipole: 3.0719 3.8023 1.0502
dipole: 4.9997
quadrupole: -84.1883 -94.3468 -99.2829
quadrupole: 0.8647 -0.3091 1.7744
quadrupole: 8.4177 -1.7408 -6.6769 0.8647 -0.3091 1.7744
hfenergy: -690.0229981 hartree
pointgroup: C01 [X(C13H18N2O1)]
dipole: 1.2007232 1.5050136 0.4030472 debye
polarizability: 229.2918911|-0.1692725|153.3361047|0.4391962|12.2858156|96.0453849 unknown
InChI: InChI=1S/C13H18N2O/c1-10-8-9-11(2)15(10)13(16)14-12-6-4-3-5-7-12/h3-7,10-11,14H,8-9H2,1-2H3
charge 0 multiplicity 1
34 atoms
O  0.2722 -1.770937 -0.53712
N  1.795029 -0.078607 -0.03805
N  -0.520215 0.346249 0.152086
C  2.197775 1.330197 0.242206
C  2.957887 -0.996514 -0.255413
C  3.714888 1.185649 0.53992
C  4.149637 -0.00796 -0.348944
C  1.922932 2.283133 -0.949656
C  3.103061 -2.024623 0.888857
C  0.49921 -0.573571 -0.168405
C  -1.926424 0.147793 0.093564
C  -2.750109 1.247144 0.467157
C  -2.534654 -1.071352 -0.312991
C  -4.154318 1.133541 0.435827
C  -3.942875 -1.16686 -0.339971
C  -4.76384 -0.076925 0.030522
H  1.672462 1.706302 1.146284
H  2.79902 -1.545753 -1.201039
H  3.870673 0.943039 1.606695
H  4.265091 2.115363 0.315999
H  4.295665 0.323656 -1.393316
H  5.089957 -0.470433 -0.005304
H  2.158819 3.326012 -0.668203
H  2.550712 2.007472 -1.815419
H  0.86943 2.244551 -1.27986
H  2.175273 -2.611751 0.987751
H  3.931745 -2.72244 0.667078
H  3.31569 -1.525588 1.852263
H  -0.232674 1.266822 0.486606
H  -2.287633 2.1925 0.782731
H  -1.899207 -1.912285 -0.595114
H  -4.771108 1.991169 0.727697
H  -4.401283 -2.111417 -0.655106
H  -5.855017 -0.167175 0.005469
