program: Gaussian 09
title: 000036868
version: EM64L-G09RevD.01
frameworkgroup: C1[X(C12H12O4)]
method: RPBEPBE
basis: SDD
operation: Freq
keyword: #pfreq=noraman
keyword: PBEPBE/SDD
title: #p freq=noraman PBEPBE/SDD
converged: YES YES NO NO
title: Mulliken charges:
elementType: O O O O C C C C C C C C C C C C H H H H H H H H H H H H
charge: -0.269694 -0.261536 -0.270036 -0.252493 0.575681 -0.293067 0.204413 -0.488358 0.163631 -0.427737 -0.323255 -0.202018 -0.029672 0.306608 -0.579541 -0.752861 0.244388 0.264650 0.245032 0.252311 0.238281 0.237926 0.233294 0.219681 0.221761 0.249376 0.248565 0.244673
chargesum: 0.00000
title: Mulliken charges with hydrogens summed into heavy atoms:
elementType: O O O O C C C C C C C C C C C C
charge: -0.269694 -0.261536 -0.270036 -0.252493 0.575681 -0.048679 0.204413 -0.223709 0.163631 -0.182705 -0.070944 0.274188 0.203622 0.306608 -0.138099 -0.010247
polarizability: 1.82458038e+02 -1.84749678e+01 1.19475270e+02 -7.80180900e+00 8.94391575e-01 1.28925753e+02
1716.lowfreq: -38.4806 -8.9211 -2.4922 -0.0005 0.0007 0.0008 11.0999 16.0407 25.1486
frequency: -38.2071 15.8669 24.7152 51.1696 58.9791 69.1558 111.0505 125.1347 191.9691 201.2368 233.9304 276.9710 308.4887 350.8564 383.3735 415.9553 440.8265 451.8994 549.1896 563.0237 590.4184 599.7531 632.3117 665.3437 681.0163 723.5607 767.4758 793.7730 809.8410 839.4596 845.8233 872.6564 879.5141 914.9106 935.1176 954.6834 958.8328 980.5650 993.5870 994.4220 1041.7773 1060.5575 1066.1415 1119.3903 1119.8284 1161.4412 1188.3607 1195.5475 1249.0382 1257.0763 1273.5316 1289.7967 1316.7119 1366.2019 1382.5774 1409.5513 1437.0472 1444.6255 1453.3823 1455.6879 1476.6591 1488.1242 1610.7802 1629.9687 1643.9115 1659.5216 3005.8507 3012.8251 3051.9677 3090.6630 3092.2064 3099.3586 3119.2593 3140.2425 3150.5656 3173.7578 3184.2365 3201.5899
redmass: 2.3901 4.7102 8.5267 3.3944 1.2267 2.4035 3.8661 4.6244 4.8364 4.8259 3.9570 5.2126 4.2257 3.6812 4.6460 3.1383 3.3351 3.8729 4.7666 3.4475 4.0736 5.0535 4.6533 2.9565 8.0325 3.8928 6.0702 4.4866 1.5935 5.5634 3.7105 1.6404 5.9438 2.8977 1.4112 1.4949 1.7171 3.8751 1.7839 1.2144 1.6472 3.8339 1.4559 1.5085 1.1276 1.9204 1.8581 3.2469 2.3559 1.7652 1.3006 1.2679 1.6962 1.2716 1.2394 2.5120 1.3639 4.0572 1.0577 1.0537 2.3699 1.2767 7.7676 8.3361 9.2333 4.8188 1.0379 1.0534 1.0865 1.1190 1.0604 1.0947 1.0940 1.1023 1.0900 1.0930 1.0960 1.1145
irintensity: 14.6229 0.0313 0.9127 0.4234 1.0503 2.9842 0.5154 1.2738 4.5311 2.3427 1.5815 2.7210 1.6977 3.9519 5.7897 3.0228 14.0877 4.1034 2.6698 3.3664 0.5420 8.1494 22.3660 12.7055 2.8495 5.6228 21.4960 3.7080 66.8691 13.5322 41.0842 12.0099 127.4268 53.2574 5.7276 82.4548 59.5474 138.0826 34.8343 3.7895 8.4282 22.1841 4.2562 2.1373 0.6371 18.5016 10.8440 352.3773 137.4791 108.8129 7.0866 3.3572 27.2894 1.4934 51.7526 13.4153 19.7144 58.6777 20.7068 23.4281 102.1997 22.4937 7.1197 3.8909 159.1634 11.1243 2.7776 126.5491 7.2747 32.3946 8.9515 9.5257 5.3949 9.4973 4.5496 1.5519 3.4240 19.6070
temp: 298.150 k
press: 1.00000 atm
elementType: 8 8 8 8 6 6 6 6 6 6 6 6 6 6 6 6 1 1 1 1 1 1 1 1 1 1 1 1
symmnumber: 1
zpe: 558516.2 jmol-1
zpe.correction: 0.212728 hartree
zpe.thermalcorrener: 0.227527 hartree
zpe.thermalcorrenthalpy: 0.228472 hartree
zpe.thermalcorrgfe: 0.167685 hartree
zpe.sumelectzpe: -764.155779 hartree
zpe.sumelectthermal: -764.140980 hartree
zpe.sumelectthermalent: -764.140035 hartree
zpe.sumelectthermalfe: -764.200822 hartree
dipole: 1.0222 0.4695 -1.6466
dipole: 1.9941
quadrupole: -84.5357 -88.2345 -93.4129
quadrupole: -3.3704 1.5524 4.9780
quadrupole: 4.1920 0.4932 -4.6852 -3.3704 1.5524 4.9780
hfenergy: -764.368507 hartree
pointgroup: C01 [X(C12H12O4)]
dipole: 0.3445209 -0.0101794 0.7047808 debye
polarizability: 185.1027896|13.0866981|117.580478|6.8032392|4.515182|128.1757936 unknown
InChI: InChI=1S/C12H12O4/c1-3-10(16-8(2)13)9-4-5-11-12(6-9)15-7-14-11/h3-6,10H,1,7H2,2H3
charge 0 multiplicity 1
28 atoms
O  2.893102 0.34286 1.699062
O  3.9061 -0.219932 -0.407442
O  -2.338612 0.742376 0.374499
O  -2.655743 1.222512 -1.892479
C  -0.273515 -0.516112 -0.151313
C  -1.782926 -0.624776 -0.002476
C  1.902828 -0.040092 0.758853
C  0.525888 -0.105064 0.959029
C  2.499767 -0.369183 -0.478183
C  0.330452 -0.833936 -1.39142
C  1.738535 -0.76937 -1.57757
C  4.190217 0.245493 0.977842
C  -2.230577 -1.554225 1.100053
C  -2.710674 1.572707 -0.691756
C  -3.040102 -2.620875 0.89479
C  -3.15798 2.923356 -0.174476
H  -2.236584 -0.910017 -0.967807
H  0.078305 0.170524 1.917417
H  -0.30436 -1.122797 -2.235311
H  2.20403 -1.011984 -2.535743
H  4.827818 -0.500317 1.4828
H  4.652642 1.246674 0.931605
H  -1.850172 -1.335072 2.10692
H  -3.329641 -3.28633 1.715333
H  -3.434115 -2.863286 -0.099998
H  -2.269123 3.547343 0.031709
H  -3.719719 2.8167 0.766875
H  -3.771643 3.426823 -0.936213
