program: Gaussian 09
title: 000036830
version: EM64L-G09RevD.01
frameworkgroup: C1[X(C9H9NO2)]
method: RPBEPBE
basis: SDD
operation: Freq
keyword: #pfreq=noraman
keyword: PBEPBE/SDD
title: #p freq=noraman PBEPBE/SDD
converged: YES YES YES YES
title: Mulliken charges:
elementType: O O N C C C C C C C C C H H H H H H H H H
charge: -0.430384 -0.268797 -0.468798 0.489137 -0.425190 -0.318968 -0.356490 -0.343983 0.281141 0.222518 -0.230157 -0.485075 0.218869 0.312907 0.220615 0.252939 0.298427 0.204060 0.352289 0.223623 0.251317
chargesum: 0.00000
title: Mulliken charges with hydrogens summed into heavy atoms:
elementType: O O N C C C C C C C C C
charge: -0.078095 -0.268797 -0.170371 0.489137 -0.206320 -0.006061 -0.135874 -0.091045 0.281141 0.222518 -0.026097 -0.010135
polarizability: 2.24833193e+02 -8.73019944e+00 1.09005099e+02 1.24638015e-02 -5.45553681e-03 4.39975153e+01
1716.lowfreq: -8.2685 -0.0003 0.0001 0.0009 5.1279 15.1115 54.2922 67.3475 118.8109
frequency: 54.2853 67.3419 118.8107 122.4729 197.7013 257.3841 295.3740 334.9287 344.8186 366.7546 404.6723 412.0186 505.2700 532.7770 536.1695 624.8843 627.0292 672.3143 714.4547 770.7692 777.2086 793.5963 837.9722 851.3603 909.9915 910.7547 976.1709 986.8847 991.4133 998.9432 1056.5489 1107.6126 1142.6238 1161.2967 1182.1462 1236.1014 1266.3002 1299.6438 1318.2212 1388.2845 1404.4357 1423.6009 1494.6951 1514.9720 1591.3063 1607.5913 1630.3617 1645.5329 3089.5006 3108.3215 3109.6645 3133.2138 3167.1518 3195.0787 3218.9043 3525.9870 3581.7959
redmass: 5.0183 4.7695 4.6216 3.1795 3.4911 4.5651 6.3121 1.1170 5.2482 4.3433 4.0323 3.0409 2.0823 6.2687 2.0457 1.1935 6.4085 3.5764 3.7552 5.7793 3.5438 1.4094 6.0376 1.4603 1.3741 4.1069 1.2709 1.3055 1.1719 2.8258 1.5957 1.4235 1.4326 2.5105 1.1077 1.9385 2.9094 1.3591 1.4661 3.9429 1.2770 3.7227 2.2912 2.4708 9.0774 4.1194 6.0869 4.6789 1.0756 1.0774 1.0868 1.0970 1.0906 1.0959 1.1163 1.0761 1.0661
irintensity: 1.4755 3.5533 1.2508 0.0042 0.8836 0.4179 1.2470 145.5963 20.7729 0.3563 9.9685 1.1204 21.5912 11.9464 26.1427 54.0892 1.5854 1.5394 0.0470 26.5899 27.7275 55.1206 2.8470 58.3423 2.5361 12.0925 0.7257 1.8206 92.3652 1.8005 7.2540 63.7346 283.8782 13.8951 7.5930 49.6436 4.6539 21.3388 1.3420 115.5756 79.2574 51.2064 32.2608 331.6276 97.5777 40.4468 17.3038 10.6165 12.3690 8.8392 21.7763 18.5417 3.8699 7.5742 8.2468 12.3936 54.1090
temp: 298.150 k
press: 1.00000 atm
elementType: 8 8 7 6 6 6 6 6 6 6 6 6 1 1 1 1 1 1 1 1 1
symmnumber: 1
zpe: 422254.4 jmol-1
zpe.correction: 0.160828 hartree
zpe.thermalcorrener: 0.171827 hartree
zpe.thermalcorrenthalpy: 0.172772 hartree
zpe.thermalcorrgfe: 0.123749 hartree
zpe.sumelectzpe: -552.680795 hartree
zpe.sumelectthermal: -552.669795 hartree
zpe.sumelectthermalent: -552.668851 hartree
zpe.sumelectthermalfe: -552.717874 hartree
dipole: -0.2658 5.2224 0.0000
dipole: 5.2291
quadrupole: -55.7813 -64.5144 -75.5148
quadrupole: -0.8819 0.0005 -0.0001
quadrupole: 9.4888 0.7557 -10.2446 -0.8819 0.0005 -0.0001
hfenergy: -552.8416228 hartree
pointgroup: C01 [X(C9H9N1O2)]
dipole: 0.1146816 -2.0541057 -0.0000004 debye
dipolederiv: -1.758787 -0.198851 -0.0000444 -0.3202064 -0.0879669 -0.0000564 -0.0000138 -0.0000422 -0.4256023 -0.645991 -0.0669091 0.0000489 0.4571054 -0.8844369 0.0002269 0.0004031 -0.0002983 -0.3601196 -1.4080579 0.2406852 0.0001276 0.3570158 -0.3520881 -0.0000778 0.0002671 -0.0000402 -0.321615 0.7744787 0.0887381 0.0000123 0.2356323 -0.1217175 0.0000145 0.0000646 -0.0000238 0.072083 0.064851 -0.1460313 0.0000143 0.0586179 0.0965073 0.0000411 -0.0000143 0.0000009 -0.1871465 0.0045747 0.0984148 0.0000328 -0.023676 0.0256543 -0.000014 0.0000458 0.0000182 -0.1491183 -0.3213848 0.0617254 0.0000106 -0.4840503 0.0156886 0.0000057 -0.0000291 0.0000295 -0.1945397 -0.3521032 -0.0957155 -0.0000039 0.2924247 0.1141999 0.000022 -0.0000118 0.0000088 -0.1622563 1.5805484 0.1840662 0.0000777 0.3205151 0.013003 0.0000199 0.0000723 0.0000211 0.0644002 1.4970125 -0.1854079 -0.0002151 -0.7751433 1.0387272 -0.0002089 -0.0011183 0.0002878 0.2532114 -0.1553799 -0.0714052 -0.0000072 0.0172594 0.0818602 0.0000006 0.0002618 0.0000155 -0.2194168 -0.1419304 0.0757246 -0.000178 -0.0027225 0.0502459 -0.0000075 0.0000689 -0.0000318 -0.2976839 0.0452695 -0.1019395 -0.0000188 -0.0800074 -0.0833306 -0.0000219 -0.0000168 -0.0000216 0.1669286 0.1546392 0.0603555 -0.0000126 0.0323858 0.0780117 -0.0000054 -0.0000161 -0.0000035 0.1798411 -0.0716081 0.1076296 -0.0000044 0.1037463 -0.0080622 -0.0000087 -0.0000023 -0.0000072 0.1743793 0.0609317 -0.0499788 -0.0000073 -0.0689853 -0.0317062 -0.0000138 -0.0000149 -0.0000128 0.1675067 0.1545005 0.0085452 -0.0000295 -0.0647484 0.0904972 0.0000151 -0.0000952 0.0000543 0.3130668 0.0201494 0.0413247 0.000072 -0.050395 -0.1373642 -0.0000165 0.0001066 -0.0000213 0.1772141 0.4218957 0.0440185 -0.0000059 0.0831624 0.0647325 0.0000359 -0.000038 0.0000236 0.3870171 -0.0675583 -0.0708566 0.0000949 -0.0873783 0.0568444 0.0000532 0.0000136 0.0000307 0.1733218 0.1439492 -0.0241328 0.0000361 -0.0005522 -0.0192997 -0.0000041 0.0000669 0.0000122 0.1885281 unknown
polarizability: 224.9163266|-8.1596753|108.9219658|-0.0124905|0.0053941|43.9975153 unknown
InChI: InChI=1S/C9H9NO2/c1-2-9(12)10-7-3-5-8(11)6-4-7/h2-6,10-11H,1H2
charge 0 multiplicity 1
21 atoms
O  4.358854 0.501075 0.00015
O  -2.200884 1.391351 0.000181
N  -1.169974 -0.726595 -0.000283
C  0.211761 -0.384526 -0.000188
C  1.153828 -1.447361 -0.000178
C  0.680668 0.959333 -0.000087
C  2.537602 -1.1846 -0.000055
C  2.063647 1.218498 0.000036
C  2.994778 0.155403 0.000066
C  -2.282283 0.123453 -0.000427
C  -3.587206 -0.612225 0.000246
C  -4.767834 0.057717 0.000846
H  0.806826 -2.488753 -0.00027
H  -0.044122 1.775114 -0.000129
H  3.250721 -2.0189 -0.000071
H  2.436978 2.246709 0.000112
H  -1.371673 -1.729296 -0.0002
H  -3.568165 -1.71188 0.000221
H  4.928986 -0.307518 0.000284
H  -5.730974 -0.462528 0.001289
H  -4.766434 1.154129 0.000859
