program: Gaussian 09
title: 000036961
version: EM64L-G09RevD.01
frameworkgroup: C1[X(C13H13ClF6O2)]
method: RPBEPBE
basis: SDD
operation: Freq
keyword: #p
keyword: freq=noraman
keyword: PBEPBE/SDD
title: #p freq=noraman PBEPBE/SDD
converged: YES YES NO NO
title: Mulliken charges:
elementType: Cl F F F F F F O O C C C C C C C C C C C C C H H H H H H H H H H H H H
charge: -0.066030 -0.119435 -0.152815 -0.147409 -0.140823 -0.149787 -0.142084 -0.398857 -0.448996 -0.087254 -0.016649 -0.256332 -0.409751 0.351624 0.363329 0.500447 -0.702124 -0.404213 -0.364934 -0.218459 -0.214464 -0.110997 0.255726 0.210863 0.252113 0.195205 0.229653 0.215838 0.232774 0.381269 0.349495 0.222643 0.284035 0.252926 0.253473
chargesum: 0.00000
title: Mulliken charges with hydrogens summed into heavy atoms:
elementType: Cl F F F F F F O O C C C C C C C C C C C C C
charge: -0.066030 -0.119435 -0.152815 -0.147409 -0.140823 -0.149787 -0.142084 -0.017588 -0.099501 0.168473 -0.016649 -0.045469 0.037567 0.351624 0.363329 0.500447 -0.023859 -0.181570 -0.080899 0.034467 0.039009 -0.110997
polarizability: 1.98903265e+02 2.83092639e+01 1.39912126e+02 1.67554541e+01 -9.60558921e+00 1.31862237e+02
1716.lowfreq: -10.3119 -7.4455 -2.9271 -0.0018 -0.0004 0.0008 18.7452 35.1786 42.9716
frequency: 18.4359 35.1575 42.7813 50.3007 69.2716 82.2816 100.7486 120.6211 143.8009 155.3570 175.6555 178.3777 194.1593 210.1441 249.1102 254.8486 266.8839 280.1029 288.2490 292.6810 302.0889 306.5649 312.8029 316.5469 344.0326 377.1906 405.3877 411.6434 433.8915 458.1562 465.2553 468.8186 491.1241 498.8723 556.1079 575.7666 605.6597 624.8856 651.1615 655.9991 699.3692 713.2240 768.7219 801.3261 824.8619 840.2865 871.8984 877.7427 930.7214 946.7010 969.8242 980.4355 988.4674 1001.3687 1007.5630 1019.5460 1023.1799 1055.6564 1072.3612 1075.8974 1094.6931 1109.6428 1115.0101 1126.7429 1135.6951 1135.8366 1149.4706 1184.7539 1226.4142 1246.1740 1287.6540 1293.8559 1300.6071 1316.8530 1331.7454 1362.3470 1379.2129 1391.4301 1398.0712 1398.9166 1477.7885 1479.9418 1482.0222 1494.7622 1592.2216 1605.5514 2939.4343 2982.1768 2992.1682 3023.1996 3065.4653 3085.4183 3093.7765 3117.6810 3161.5957 3169.4553 3188.1890 3525.9469 3579.0775
redmass: 7.5615 12.8036 3.6964 3.2192 12.1123 4.4138 11.5324 8.3074 9.0647 7.0123 9.2169 10.1252 2.2934 1.9663 6.6419 10.2602 1.7664 2.9850 7.2680 4.6431 5.6677 2.8474 3.0674 5.6904 3.4612 1.6598 3.8466 3.8658 8.3987 15.8275 7.2420 6.4151 12.8492 3.9119 5.1575 6.9771 10.0131 7.1338 5.0968 8.8605 4.2916 3.8256 1.7313 1.7895 1.5552 1.7179 2.9419 6.4112 2.1205 1.4049 4.6908 1.6714 4.5426 4.2018 2.9367 8.0202 3.9629 4.0011 2.7265 5.1137 6.2312 1.4830 3.5799 3.3196 2.5620 2.2002 2.4178 1.1372 1.6018 1.2533 1.2617 1.2652 1.3061 1.3816 1.3021 1.7408 2.9490 2.4572 1.4114 1.5147 1.1254 2.0908 1.0514 1.0902 7.5727 6.2354 1.0823 1.0364 1.0711 1.0820 1.0957 1.0993 1.0940 1.0897 1.0902 1.0949 1.0955 1.0659 1.0660
irintensity: 0.4148 0.0657 0.6234 0.1185 0.1568 0.7567 0.1187 0.0550 0.5117 8.4835 1.0600 5.4762 3.1715 10.7641 12.3943 3.1774 67.2219 54.3793 6.6890 36.4441 21.4225 13.5804 16.3992 0.6036 27.9500 82.5151 1.7043 0.2749 1.4157 4.5890 9.4390 19.1799 3.3387 4.3175 38.5191 11.6368 20.5634 0.4407 16.1805 6.8180 2.1875 3.7363 36.0749 12.7189 14.7380 24.9960 60.6977 79.9460 6.6126 5.8661 33.7012 4.5462 100.9506 38.4596 103.6404 14.9172 47.0487 81.3984 19.9803 297.4976 176.1361 9.3954 60.7232 47.0669 33.2725 27.8900 166.2250 0.7969 9.6529 4.2495 13.1716 3.3602 6.0312 16.9033 2.9898 25.1921 2.4880 12.9994 15.3494 8.1162 19.9491 59.7148 11.4977 17.9730 3.7782 6.8155 31.5007 24.8183 22.8034 6.3422 14.6975 34.0359 32.8947 15.7821 2.3639 3.7395 0.7951 33.4705 5.7826
temp: 298.150 k
press: 1.00000 atm
elementType: 17 9 9 9 9 9 9 8 8 6 6 6 6 6 6 6 6 6 6 6 6 6 1 1 1 1 1 1 1 1 1 1 1 1 1
symmnumber: 1
zpe: 633907.6 jmol-1
zpe.correction: 0.241443 hartree
zpe.thermalcorrener: 0.263826 hartree
zpe.thermalcorrenthalpy: 0.264770 hartree
zpe.thermalcorrgfe: 0.189134 hartree
zpe.sumelectzpe: -1711.045438 hartree
zpe.sumelectthermal: -1711.023055 hartree
zpe.sumelectthermalent: -1711.022111 hartree
zpe.sumelectthermalfe: -1711.097747 hartree
dipole: 2.1287 3.1637 -0.1301
dipole: 3.8154
quadrupole: -152.8349 -124.1269 -135.1830
quadrupole: 6.8244 2.5864 0.2162
quadrupole: -15.4533 13.2547 2.1986 6.8244 2.5864 0.2162
hfenergy: -1711.2868809 hartree
pointgroup: C01 [X(C13H13Cl1F6O2)]
dipole: -0.761098 -1.2431366 -0.3585923 debye
polarizability: 195.6233836|34.5816607|138.8145247|-8.8845099|10.6189007|136.2397187 unknown
InChI: InChI=1S/C13H13ClF6O2/c1-2-9(10(21)7-3-5-8(14)6-4-7)11(22,12(15,16)17)13(18,19)20/h3-6,9-10,21-22H,2H2,1H3
charge 0 multiplicity 1
35 atoms
Cl 5.781764 1.224511 -0.425814
F  -0.700125 1.240728 2.051954
F  -2.551358 2.076159 1.110775
F  -2.556732 -0.05917 1.87039
F  -3.726331 0.458399 -0.806794
F  -2.420906 2.133354 -1.599203
F  -2.23953 0.063155 -2.467036
O  -0.124016 1.221533 -0.611107
O  0.043007 -1.440261 1.989439
C  -0.841754 -1.066066 -0.352491
C  -1.273195 0.436122 -0.217718
C  0.353423 -1.526988 0.561511
C  -2.008862 -2.100579 -0.255455
C  -1.758742 0.895186 1.211549
C  -2.425724 0.761901 -1.258087
C  1.685999 -0.82065 0.329425
C  -1.743784 -3.354414 -1.119088
C  2.368885 -1.010931 -0.89599
C  2.276583 -0.015829 1.329724
C  3.613075 -0.38991 -1.138461
C  3.522933 0.610515 1.107029
C  4.168969 0.417736 -0.12787
H  -0.451918 -1.106005 -1.387741
H  0.494373 -2.595417 0.284583
H  -2.965516 -1.659324 -0.577485
H  -2.174714 -2.396425 0.799373
H  -1.679231 -3.08409 -2.188938
H  -0.805245 -3.86866 -0.841954
H  -2.564807 -4.084376 -1.005668
H  -0.329433 2.19411 -0.593733
H  -0.73699 -2.011003 2.200109
H  1.93769 -1.64631 -1.680112
H  1.759807 0.110941 2.283589
H  4.138948 -0.534939 -2.086448
H  3.980957 1.233697 1.880544
