program: Gaussian 09
title: 000036823
version: EM64L-G09RevD.01
frameworkgroup: C1[X(C7H7NO2S2)]
method: RPBEPBE
basis: SDD
operation: Freq
keyword: #p
keyword: freq=noraman
keyword: PBEPBE/SDD
title: #p freq=noraman PBEPBE/SDD
converged: NO YES NO NO
title: Mulliken charges:
elementType: S S O O N C C C C C C C H H H H H H H
charge: 0.310348 0.310840 -0.198321 -0.197239 -0.204582 -0.233205 -0.232233 -0.625032 -0.624404 0.202687 0.208902 -0.599637 0.294369 0.267213 0.294413 0.266905 0.248192 0.259535 0.251249
chargesum: 0.00000
title: Mulliken charges with hydrogens summed into heavy atoms:
elementType: S S O O N C C C C C C C
charge: 0.310348 0.310840 -0.198321 -0.197239 -0.204582 -0.233205 -0.232233 -0.063450 -0.063086 0.202687 0.208902 0.159340
polarizability: 1.57206547e+02 -7.64543720e-01 1.48921695e+02 3.92221608e-01 2.37356316e+00 6.02030421e+01
1716.lowfreq: -7.1418 -2.3381 -0.0027 -0.0022 -0.0019 9.3794 36.8791 54.1080 96.5608
frequency: 36.3971 54.0856 96.5608 122.5753 170.4022 185.0794 232.6021 252.7313 254.1980 267.8110 348.1132 359.1171 435.5252 440.5114 461.4361 591.7766 597.6388 622.1769 718.5482 719.9016 733.9778 833.4279 841.7212 899.2996 916.6949 964.6908 1018.2247 1125.9750 1129.9445 1131.8150 1165.5721 1196.5615 1223.1858 1290.6206 1297.3340 1359.5321 1432.9331 1433.1215 1436.5623 1469.6020 1486.0708 1564.3898 1618.2003 1672.3276 3000.3785 3035.7806 3042.2492 3091.6228 3109.9907 3119.0511 3121.5117
redmass: 1.0291 3.5398 12.2135 4.2725 9.1521 7.2506 3.2030 7.9438 3.4798 4.1532 14.5138 7.7652 8.3647 3.6753 11.5209 5.4815 11.2307 4.3170 10.9626 6.0750 12.0708 3.9350 7.7924 2.4820 1.6142 2.7126 3.3152 1.3045 1.1891 8.9387 4.6840 1.1543 2.3333 1.2333 1.1930 5.6177 1.0824 1.0844 1.2675 1.0581 1.0602 11.6690 12.1709 11.4529 1.0334 1.0572 1.0595 1.1018 1.1071 1.1017 1.1067
irintensity: 0.0890 4.2832 0.0266 7.9050 1.5001 1.4629 4.8623 0.6852 2.1829 0.0723 8.0481 0.0093 23.8160 0.1043 0.0031 1.1696 3.9294 1.6869 23.4768 1.4266 0.0878 21.6894 12.8446 5.3662 6.8063 46.6940 2.4817 1.3096 18.6278 30.3259 64.0647 4.7721 9.0751 3.3920 19.1639 250.7405 16.7687 12.6888 99.5525 15.8956 6.0000 126.8112 522.1060 31.2521 43.1515 6.0895 24.7391 18.8120 0.7357 1.6932 7.0159
temp: 298.150 k
press: 1.00000 atm
elementType: 16 16 8 8 7 6 6 6 6 6 6 6 1 1 1 1 1 1 1
symmnumber: 1
zpe: 345299.4 jmol-1
zpe.correction: 0.131518 hartree
zpe.thermalcorrener: 0.143412 hartree
zpe.thermalcorrenthalpy: 0.144356 hartree
zpe.thermalcorrgfe: 0.092246 hartree
zpe.sumelectzpe: -1271.390509 hartree
zpe.sumelectthermal: -1271.378615 hartree
zpe.sumelectthermalent: -1271.377670 hartree
zpe.sumelectthermalfe: -1271.429780 hartree
dipole: -3.6205 0.0284 0.0034
dipole: 3.6206
quadrupole: -63.5830 -103.8656 -83.2843
quadrupole: 0.1749 0.0076 -0.9203
quadrupole: 19.9946 -20.2880 0.2933 0.1749 0.0076 -0.9203
hfenergy: -1271.5220263 hartree
pointgroup: C01 [X(C7H7N1O2S2)]
dipole: -1.4243779 0.014162 0.0012977 debye
dipolederiv: -0.3377099 0.2902803 -0.0037063 0.1764319 -0.1221314 0.0718003 0.0293335 -0.0226007 0.0150237 -0.3424989 -0.2896068 0.0035683 -0.1787852 -0.1194686 0.0701929 -0.030313 -0.0228326 0.0140592 -0.633349 -0.3198072 -0.0085284 -0.1600808 -1.0259931 -0.0108869 0.0054193 -0.0278877 -0.324709 -0.6157361 0.3213501 0.0083663 0.1586679 -1.010765 -0.0163394 -0.0007216 -0.0293615 -0.3247031 -1.1927513 0.0236355 -0.012779 -0.0234438 -0.8585955 -0.0320237 0.0222957 -0.0414526 -0.2111022 -0.2306508 -0.8735279 0.0203085 -0.9281213 0.0443976 -0.0429196 -0.0503796 -0.051432 -0.1115765 -0.2153396 0.8803649 -0.0226527 0.9288259 0.03268 -0.0362005 0.0501033 -0.0540523 -0.1132305 0.1977967 0.1343473 0.0419501 0.1644984 -0.0160335 0.0363815 0.0628481 0.0482328 0.0737093 0.1990367 -0.1356131 -0.0406963 -0.16593 -0.0146489 0.0362449 -0.062113 0.0479838 0.0733719 1.290616 0.4056488 -0.0064032 -0.0499709 1.3742608 0.0357233 -0.0250908 0.0798503 0.2662905 1.2697696 -0.4234188 0.0123797 0.0390817 1.3617498 0.0445151 0.022309 0.0866184 0.27611 0.5898866 -0.0483731 0.0267617 -0.0025137 0.074002 -0.0009894 0.024994 -0.0010751 0.2235419 0.0408628 -0.01203 0.0043638 -0.1016755 0.0555204 -0.0683639 -0.0342337 -0.0099613 -0.0608324 -0.0541144 0.0564766 0.0076564 0.0896016 0.0261693 -0.0095413 0.0070607 0.003982 0.1117195 0.0410106 0.0121758 -0.0040356 0.1022407 0.0550367 -0.0676971 0.0346204 -0.0101406 -0.0605727 -0.0550438 -0.0561545 -0.0082528 -0.088949 0.0264798 -0.010019 -0.0078526 0.0037989 0.1114261 -0.0444969 0.0101762 -0.0312038 0.06443 0.0810854 0.0740266 -0.1088667 0.0530048 -0.0709045 0.0947692 0.017395 -0.0011307 -0.1176365 -0.0193599 0.0282486 -0.0049506 0.0179068 0.1251074 -0.0020575 0.0066812 0.0140341 0.0933285 0.0556144 -0.1021524 0.0655374 -0.0705814 -0.0127288 unknown
polarizability: 157.2033175|-0.7812575|148.9316501|0.398453|2.2434416|60.1963164 unknown
InChI: InChI=1S/C7H7NO2S2/c1-8-6(9)4-5(7(8)10)12-3-2-11-4/h2-3H2,1H3
charge 0 multiplicity 1
19 atoms
S  -1.708138 1.853925 0.021834
S  -1.715054 -1.857525 -0.015926
O  1.500319 2.33995 0.071808
O  1.491724 -2.356824 -0.079317
N  1.880972 -0.010335 0.000404
C  -0.351283 0.680759 0.025319
C  -0.353979 -0.690035 -0.01942
C  -3.106211 0.644642 -0.419253
C  -3.110651 -0.642635 0.418213
C  1.074166 1.159949 0.04073
C  1.070218 -1.175251 -0.040801
C  3.345461 -0.012235 0.00616
H  -3.04043 0.425574 -1.496158
H  -4.022247 1.227157 -0.22219
H  -3.049248 -0.423782 1.495411
H  -4.027822 -1.221898 0.216801
H  3.737603 -0.401119 0.961994
H  3.684015 1.027504 -0.129713
H  3.727786 -0.640419 -0.815293
