program: Gaussian 09
title: 000036863
version: EM64L-G09RevD.01
frameworkgroup: C1[X(C13H12BrNO2)]
method: RPBEPBE
basis: SDD
operation: Freq
keyword: #p
keyword: freq=noraman
keyword: PBEPBE/SDD
title: #p freq=noraman PBEPBE/SDD
converged: NO YES NO NO
title: Mulliken charges:
elementType: Br O O N C C C C C C C C C C C C C H H H H H H H H H H H H
charge: -0.005522 -0.411802 -0.228152 -0.428272 0.211037 0.305819 0.536514 -0.328186 -0.410793 -0.376506 -0.454620 -0.535570 -0.405128 -0.249019 -0.271710 -0.216567 0.195486 0.230032 0.239337 0.300513 0.248076 0.195319 0.250720 0.252431 0.265449 0.225219 0.232866 0.250591 0.382438
chargesum: 0.00000
title: Mulliken charges with hydrogens summed into heavy atoms:
elementType: Br O O N C C C C C C C C C C C C C
charge: -0.005522 -0.029364 -0.228152 -0.127759 0.211037 0.305819 0.536514 0.141183 -0.162717 -0.181187 -0.203900 -0.017690 -0.405128 -0.023799 -0.038845 0.034024 0.195486
polarizability: 2.71088533e+02 -1.43303866e+00 1.92999977e+02 1.08881938e+00 2.79358664e-01 7.29347554e+01
1716.lowfreq: -13.1807 -4.3642 -0.0006 -0.0004 -0.0003 2.8632 22.2444 26.8926 37.1647
frequency: 22.1938 26.8392 36.2501 52.6817 77.5164 129.3954 132.5430 152.5154 156.0693 184.3541 235.7413 250.0080 271.8377 287.7345 356.8893 450.1273 469.2284 480.8536 488.7381 500.6323 513.1743 532.2347 579.9324 596.1970 642.6628 651.8806 656.2880 721.5987 763.3064 776.1985 781.4749 802.2487 818.1221 848.6141 874.5178 885.5276 891.2365 957.6096 974.5316 1018.1334 1041.4950 1071.3514 1075.1431 1087.9213 1103.5715 1142.7965 1171.8066 1187.8276 1196.8364 1202.8635 1246.3979 1251.4205 1276.7745 1307.0374 1328.5252 1348.9778 1386.9267 1396.5253 1400.5196 1429.2949 1445.0931 1451.0406 1480.0758 1500.9859 1532.3763 1585.6731 1592.1931 1620.2380 1668.8134 2945.2486 2991.7100 3010.5734 3050.5444 3121.0706 3135.3040 3151.6125 3163.7615 3174.6525 3177.0188 3513.5955 3590.0617
redmass: 8.5557 11.2189 2.6931 7.5214 2.0968 2.7491 2.9275 8.7291 9.0709 3.5488 5.3412 1.8890 4.6827 9.8063 4.6357 4.3327 3.3315 4.6979 5.4670 6.2630 1.9298 5.7117 3.0540 4.4689 1.4152 4.9352 4.5336 1.4024 6.0326 1.3926 5.0302 1.4914 2.6281 4.9312 1.4651 1.3968 4.3544 1.3536 1.3221 4.3237 3.1419 1.8144 2.2731 2.2550 1.9958 2.9802 1.4417 1.1746 1.3567 1.4363 1.6204 1.7198 1.1007 1.8516 1.7931 2.3964 3.3540 2.1739 2.6651 2.6161 1.1299 2.0818 2.6376 1.0877 2.8533 6.2079 6.0290 6.0227 8.3523 1.0659 1.0602 1.0954 1.0999 1.0865 1.0872 1.0925 1.0918 1.0973 1.0968 1.0640 1.0762
irintensity: 0.1747 1.0316 10.6952 0.3345 3.1947 8.3827 2.7297 2.1950 1.1847 0.6849 5.7879 78.4585 2.1327 4.3245 5.3397 15.1114 0.4343 2.6770 13.6155 2.5170 32.7359 42.0799 7.9104 10.2064 123.9155 9.9739 0.6055 3.1481 51.9361 147.2799 15.7524 5.9283 11.7504 7.7390 0.0880 1.3598 31.1586 0.5558 1.0997 173.9646 152.5895 2.9083 19.2214 31.0957 6.6493 22.9642 0.3522 3.6373 5.7269 6.2330 0.2207 3.9112 12.9557 1.7662 103.3772 64.4520 9.3678 65.3619 151.9038 44.7392 24.8668 26.6897 27.9330 27.9167 229.2095 23.7929 138.6369 6.5687 207.2892 54.3521 11.3679 14.4318 17.4520 11.5251 14.6905 19.0807 16.6506 15.4550 7.0364 30.9314 17.4795
temp: 298.150 k
press: 1.00000 atm
elementType: 35 8 8 7 6 6 6 6 6 6 6 6 6 6 6 6 6 1 1 1 1 1 1 1 1 1 1 1 1
symmnumber: 1
zpe: 577816.0 jmol-1
zpe.correction: 0.220078 hartree
zpe.thermalcorrener: 0.236209 hartree
zpe.thermalcorrenthalpy: 0.237153 hartree
zpe.thermalcorrgfe: 0.172966 hartree
zpe.sumelectzpe: -720.045616 hartree
zpe.sumelectthermal: -720.029486 hartree
zpe.sumelectthermalent: -720.028542 hartree
zpe.sumelectthermalfe: -720.092728 hartree
dipole: 4.0701 2.7967 0.3057
dipole: 4.9478
quadrupole: -98.6718 -101.6655 -113.4501
quadrupole: 6.9330 1.1398 -0.2893
quadrupole: 5.9240 2.9303 -8.8543 6.9330 1.1398 -0.2893
hfenergy: -720.2656945 hartree
pointgroup: C01 [X(C13H12Br1N1O2)]
dipole: 1.5409215 1.1824166 0.1296488 debye
polarizability: 271.0249301|2.7258874|193.0391279|0.2925884|1.9236706|72.9592075 unknown
InChI: InChI=1S/C13H12BrNO2/c14-11-5-1-4-10-9(11)3-2-6-12(10)15-8-7-13(16)17/h1-6,15-16H,7-8H2
charge 0 multiplicity 1
29 atoms
Br -5.42112 -0.674348 0.018495
O  6.022634 1.170896 0.062168
O  5.325903 -1.034837 -0.15891
N  1.236918 0.355501 0.028706
C  -1.232331 0.334125 0.001907
C  0.045313 -0.369296 0.008817
C  -2.462824 -0.446335 -0.001098
C  2.554555 -0.282842 0.05997
C  0.058802 -1.779751 -0.013921
C  -1.311287 1.76361 -0.005402
C  -2.39847 -1.876654 -0.022871
C  3.653925 0.788812 -0.022139
C  -3.698663 0.28989 0.012235
C  -1.157445 -2.514929 -0.035023
C  -2.540633 2.426156 0.005562
C  -3.757261 1.681929 0.019633
C  5.041251 0.176781 -0.046647
H  2.691944 -0.890243 0.98068
H  2.661598 -0.979467 -0.793979
H  1.196647 1.355254 0.213196
H  1.00766 -2.322925 -0.005285
H  -0.403055 2.376171 -0.039447
H  -3.324972 -2.455611 -0.028737
H  3.60311 1.494902 0.828922
H  3.534195 1.396339 -0.941291
H  -1.11079 -3.609471 -0.052343
H  -2.582854 3.520058 -0.003018
H  -4.720666 2.198706 0.030011
H  6.925214 0.751678 0.02311
