program: Gaussian 09
title: 000036822
version: EM64L-G09RevD.01
frameworkgroup: C1[X(C8H10N2)]
method: RPBEPBE
basis: SDD
operation: Freq
keyword: #pfreq=noraman
keyword: PBEPBE/SDD
title: #p freq=noraman PBEPBE/SDD
converged: YES YES NO YES
title: Mulliken charges:
elementType: N N C C C C C C C C H H H H H H H H H H
charge: -0.008216 -0.008224 -0.400703 -0.400696 -0.470456 -0.470462 0.032212 0.032222 -0.291538 -0.291541 0.214110 0.207302 0.214105 0.207303 0.232776 0.244371 0.232765 0.244374 0.240148 0.240148
chargesum: 0.00000
title: Mulliken charges with hydrogens summed into heavy atoms:
elementType: N N C C C C C C C C
charge: -0.008216 -0.008224 0.020709 0.020712 0.006691 0.006677 0.032212 0.032222 -0.051390 -0.051393
polarizability: 1.23370804e+02 -3.20008626e-04 9.51924106e+01 1.43132853e-03 1.30856311e+00 5.69622830e+01
1716.lowfreq: -22.7219 -11.8736 -0.0009 -0.0006 -0.0004 10.3177 90.3736 108.0227 272.2457
frequency: 90.2217 108.0223 272.2449 291.5628 352.6062 428.7333 437.4519 462.1226 502.2494 569.8615 596.1506 686.4385 746.7422 830.8250 836.7165 852.9981 862.1717 904.9883 924.1114 954.2518 990.9040 1041.1223 1081.5742 1092.5918 1124.8606 1132.4885 1155.9149 1222.2755 1233.0735 1237.9365 1248.6739 1265.2871 1330.2944 1332.9809 1341.7553 1350.6396 1395.1554 1424.5973 1448.8796 1449.7813 1473.8127 1477.4821 1509.6965 1524.3337 2974.7525 2974.9432 2981.6608 2984.1759 3042.3619 3045.3302 3048.3138 3055.9406 3127.5837 3154.1808
redmass: 2.3223 3.3343 2.6526 1.7065 4.3209 3.2695 4.5207 3.5848 3.0070 6.1625 2.3483 5.0115 2.7604 1.8857 1.9469 1.7822 2.4267 1.4330 2.8773 1.4804 2.2695 2.9703 1.9935 1.5517 2.0043 1.5747 1.6720 2.4874 1.7829 1.3214 3.0943 1.2631 1.7242 1.4274 1.4138 1.5607 3.0462 2.0962 1.0797 1.1701 1.1002 1.0905 8.2560 4.4766 1.0664 1.0669 1.0655 1.0598 1.0947 1.0938 1.0982 1.1023 1.0876 1.0991
irintensity: 0.2239 0.0029 12.7777 0.2129 1.5092 1.4460 4.2128 2.2140 0.3165 0.0111 1.8557 0.1833 1.8792 6.5517 4.0145 15.7941 6.9690 14.3564 7.8521 0.0064 7.5898 3.1101 0.1025 1.6456 8.2979 2.2508 1.4298 0.2146 1.0586 1.2877 6.3072 0.8462 1.4723 1.6085 3.2784 0.0487 93.7062 6.2946 32.6470 4.9639 11.4824 10.2420 2.5455 4.4362 26.2492 0.0300 29.2405 40.8550 35.7133 46.5058 13.7195 59.3186 1.7990 51.9938
temp: 298.150 k
press: 1.00000 atm
elementType: 7 7 6 6 6 6 6 6 6 6 1 1 1 1 1 1 1 1 1 1
symmnumber: 1
zpe: 436552.2 jmol-1
zpe.correction: 0.166274 hartree
zpe.thermalcorrener: 0.174164 hartree
zpe.thermalcorrenthalpy: 0.175109 hartree
zpe.thermalcorrgfe: 0.133538 hartree
zpe.sumelectzpe: -419.612258 hartree
zpe.sumelectthermal: -419.604368 hartree
zpe.sumelectthermalent: -419.603424 hartree
zpe.sumelectthermalfe: -419.644994 hartree
dipole: -1.2740 0.0001 0.0000
dipole: 1.2740
quadrupole: -51.0201 -65.4898 -59.4781
quadrupole: 0.0000 0.0004 -0.1551
quadrupole: 7.6426 -6.8271 -0.8154 0.0000 0.0004 -0.1551
hfenergy: -419.7785323 hartree
pointgroup: C01 [X(C8H10N2)]
dipole: -0.5012137 -0.000023 -0.0000242 debye
dipolederiv: -0.2718978 -0.1018173 -0.0086477 0.0201645 -0.225379 0.0115448 0.0012793 0.0085599 -0.2670367 -0.2718763 0.1018124 0.0086332 -0.0201659 -0.2253798 0.011538 -0.0012784 0.0085691 -0.267037 0.1157791 0.013688 0.0228396 -0.0088486 0.0179177 0.0198322 -0.0194973 0.017827 0.1400098 0.1157858 -0.0136979 -0.0228538 0.00887 0.017913 0.0198269 0.0194777 0.0178172 0.1399955 -0.0716801 -0.0493244 -0.0077645 -0.1755443 -0.0273116 -0.004113 -0.0860534 -0.0344101 0.1059022 -0.0717454 0.0493236 0.0077419 0.1754567 -0.0272676 -0.0041101 0.0860442 -0.0344426 0.1059163 0.2837955 0.2036317 0.035253 0.6683974 0.0771131 -0.005425 0.1240198 0.0173371 0.0751943 0.2838102 -0.2036204 -0.0352439 -0.6683687 0.0770906 -0.0054741 -0.1240239 0.0173322 0.0751779 0.1101828 -0.0172647 0.0026159 -0.4169014 0.0690647 0.0020346 -0.0304314 0.0003846 -0.0255156 0.1101871 0.0172641 -0.0026119 0.4169023 0.0690567 0.0020617 0.0304409 0.0003838 -0.0255107 -0.1589618 -0.1187333 -0.0203197 -0.1276704 -0.0189554 -0.0136002 -0.0535552 -0.0247808 0.0770196 0.0773617 0.0234633 -0.0226239 0.0478505 0.0404799 -0.0431427 0.0365625 -0.0062377 -0.1795976 -0.1589935 0.1187482 0.0202527 0.1276728 -0.0189549 -0.0135592 0.0534823 -0.0247459 0.0770415 0.0773699 -0.0234616 0.0227065 -0.0478321 0.0404849 -0.0431455 -0.0364709 -0.0062382 -0.1795961 -0.0043052 -0.04524 -0.0199736 -0.0188341 0.0754675 -0.0508315 -0.0114803 -0.0919879 -0.1002536 0.020798 0.0374167 -0.0152638 0.0150313 -0.0621002 0.0871228 0.0228651 0.1159396 0.0409626 -0.0043043 0.0452716 0.0200162 0.0188592 0.0754925 -0.0507815 0.0115113 -0.0919406 -0.1002891 0.0208096 -0.0374632 0.01526 -0.0150418 -0.0621438 0.0870964 -0.0228786 0.1159069 0.0410064 -0.1010561 0.0652905 0.0041064 0.107494 0.0537046 -0.0034338 0.0045858 -0.0026369 0.1333053 -0.1010591 -0.0652873 -0.0041227 -0.1074913 0.053707 -0.0034407 -0.0045997 -0.0026369 0.133305 unknown
polarizability: 123.3708038|0.0000681|95.1621968|0.0028837|1.693075|56.9924969 unknown
InChI: InChI=1S/C8H10N2/c1-2-4-8-7(3-1)9-5-6-10-8/h5-6H,1-4H2
charge 0 multiplicity 1
20 atoms
N  1.235114 -1.421389 -0.074558
N  1.235132 1.421332 0.074621
C  -2.462529 -0.69274 0.343441
C  -2.462395 0.692761 -0.344018
C  -1.228197 -1.514617 -0.090311
C  -1.228189 1.514577 0.090194
C  0.060839 -0.714014 -0.035641
C  0.060848 0.713973 0.035639
C  2.395927 -0.706051 -0.038564
C  2.395935 0.705975 0.038709
H  -3.385424 -1.249736 0.096396
H  -2.455071 -0.554938 1.443313
H  -3.385364 1.249773 -0.097281
H  -2.454555 0.554983 -1.44389
H  -1.363988 -1.874577 -1.130861
H  -1.102568 -2.421324 0.52899
H  -1.364254 1.874285 1.130796
H  -1.102407 2.421421 -0.52887
H  3.329765 -1.277696 -0.069372
H  3.329781 1.277604 0.069568
