program: Gaussian 09
title: 000036824
version: EM64L-G09RevD.01
frameworkgroup: C1[X(C8H9NO2S2)]
method: RPBEPBE
basis: SDD
operation: Freq
keyword: #p
keyword: freq=noraman
keyword: PBEPBE/SDD
title: #p freq=noraman PBEPBE/SDD
converged: YES YES NO NO
title: Mulliken charges:
elementType: S S O O N C C C C C C C C H H H H H H H H H
charge: 0.310854 0.310407 -0.197034 -0.197066 -0.210740 -0.248119 -0.247240 0.208586 0.207656 -0.321028 -0.625094 -0.624052 -0.663159 0.239609 0.239876 0.294178 0.266703 0.293840 0.266586 0.236368 0.237077 0.221792
chargesum: 0.00000
title: Mulliken charges with hydrogens summed into heavy atoms:
elementType: S S O O N C C C C C C C C
charge: 0.310854 0.310407 -0.197034 -0.197066 -0.210740 -0.248119 -0.247240 0.208586 0.207656 0.158457 -0.064213 -0.063626 0.032078
polarizability: 1.73143243e+02 1.63366462e-01 1.55565122e+02 -4.82379303e+00 2.36929889e+00 7.13630761e+01
1716.lowfreq: -11.5613 -0.0032 -0.0010 -0.0008 0.4718 4.5319 11.8100 51.5690 81.1020
frequency: 8.1121 51.3964 81.0606 96.1035 148.6185 170.8161 206.6373 220.2274 233.1881 266.5943 276.7042 335.9580 358.5894 377.3373 439.7946 460.9075 476.3886 591.6747 596.2478 621.3756 705.5105 723.3137 734.4676 785.6450 802.1516 837.1288 898.8578 915.4422 976.8571 999.2189 1019.0415 1088.3810 1129.9974 1135.6686 1164.2471 1192.0033 1195.0113 1289.2972 1297.4429 1328.0468 1337.7182 1367.6268 1391.6844 1431.2781 1433.1286 1455.6957 1470.4387 1482.2226 1563.6887 1615.4951 1669.2428 2993.1711 3022.7365 3035.1783 3041.8545 3078.6877 3092.1355 3107.3764 3109.6271 3121.2638
redmass: 2.5444 3.3912 4.7923 12.3099 8.3015 2.3014 2.2278 7.3769 3.3940 4.1622 1.7552 9.0381 7.6091 7.9661 3.6834 11.0573 4.5258 5.4934 9.3554 4.3145 3.3681 11.0639 12.0781 1.5090 4.8209 3.6501 2.4629 1.6028 2.5739 2.7307 3.3361 2.2727 1.1878 5.6785 4.4512 2.1208 1.1548 1.2311 1.1936 1.2371 2.8078 1.8227 1.2395 1.0825 1.0821 1.1029 1.0420 1.0522 11.7067 12.4478 11.6362 1.0354 1.0597 1.0572 1.0594 1.1034 1.0990 1.1036 1.1071 1.1066
irintensity: 0.2109 5.4164 0.8452 0.0208 5.0603 1.9156 0.0489 0.3577 4.4737 0.0020 1.3243 13.7215 0.0166 3.2265 0.0936 1.3084 11.6600 1.0766 3.5253 1.6903 0.1565 22.8189 0.1032 4.5416 23.6850 34.5162 4.9237 7.2978 4.6186 23.4083 2.4146 16.6141 19.2537 10.5685 62.5210 5.2703 4.0640 3.3851 24.8877 5.8364 282.3766 131.8710 11.1675 12.1949 11.2814 39.3398 23.1336 8.1577 127.8817 486.4940 31.2679 21.9001 22.1687 6.1891 25.7207 0.2954 41.2317 17.8633 0.7397 7.1164
temp: 298.150 k
press: 1.00000 atm
elementType: 16 16 8 8 7 6 6 6 6 6 6 6 6 1 1 1 1 1 1 1 1 1
symmnumber: 1
zpe: 419026.2 jmol-1
zpe.correction: 0.159599 hartree
zpe.thermalcorrener: 0.172747 hartree
zpe.thermalcorrenthalpy: 0.173691 hartree
zpe.thermalcorrgfe: 0.117482 hartree
zpe.sumelectzpe: -1310.616820 hartree
zpe.sumelectthermal: -1310.603672 hartree
zpe.sumelectthermalent: -1310.602728 hartree
zpe.sumelectthermalfe: -1310.658937 hartree
dipole: -3.3941 -0.0310 0.5096
dipole: 3.4323
quadrupole: -67.0209 -110.2254 -89.6495
quadrupole: 0.1250 -1.0443 -0.9930
quadrupole: 21.9443 -21.2601 -0.6842 0.1250 -1.0443 -0.9930
hfenergy: -1310.7764187 hartree
pointgroup: C01 [X(C8H9N1O2S2)]
dipole: -1.3365449 -0.011868 0.1923591 debye
dipolederiv: -0.3472888 0.282918 0.022281 0.183539 -0.117185 0.0568628 0.061454 -0.0473923 0.0092422 -0.346804 -0.2900868 0.0271903 -0.1756526 -0.1230545 0.0826366 0.0005854 0.0027768 0.0136128 -0.6276183 -0.3033315 0.0132467 -0.136229 -1.0079252 0.0230034 0.0255246 0.004166 -0.3178789 -0.631344 0.3027028 0.0318767 0.1378917 -0.9995657 -0.0563381 0.0215998 -0.0669364 -0.3219247 -1.3082013 -0.0023492 -0.024165 -0.0041753 -0.8314402 -0.0316103 0.0519896 -0.04149 -0.2566939 -0.2282223 -0.8771146 0.0109515 -0.9480702 0.0290065 0.0224017 -0.0417443 0.0264736 -0.1087089 -0.2432696 0.8666516 -0.0252107 0.9388811 0.0508238 -0.100325 0.0666659 -0.1300483 -0.1133084 1.3219929 0.4042668 -0.065468 -0.0983834 1.335366 -0.0068268 -0.103368 0.0399002 0.2664395 1.331255 -0.3914327 -0.0494474 0.1047718 1.3262825 0.0956207 -0.0515824 0.1338792 0.2665827 0.7963578 -0.000198 0.057085 0.0039939 0.13498 -0.003523 0.0122859 -0.0035738 0.2618221 0.2043901 0.1393021 0.0308214 0.1722397 -0.0129792 0.024774 0.0532593 0.0363771 0.0667558 0.1911209 -0.1283973 -0.0507713 -0.1639607 -0.0177513 0.0475616 -0.0748495 0.057404 0.0828408 -0.0829253 0.0014983 -0.0372131 0.001099 0.0502972 0.0055287 -0.0491405 0.0050677 -0.0728002 0.0083871 -0.0107435 -0.016223 0.086249 0.004781 -0.1159841 -0.0048947 -0.061697 0.0058275 0.0081242 0.0117109 -0.0142559 -0.0876204 -0.0099916 0.1141436 -0.0121822 0.0602066 0.020918 0.0385239 -0.0130965 -0.0030556 -0.1088374 0.0545899 -0.0598637 -0.0434415 -0.0088601 -0.0581016 -0.0553432 0.0564053 0.0211232 0.0881618 0.0269466 -0.0172549 0.0212604 -0.0008478 0.1088686 0.0426051 0.0114452 -0.0128595 0.0975715 0.0559035 -0.0750987 0.0265366 -0.0105131 -0.0631399 -0.056233 -0.0567382 0.0053102 -0.0902887 0.0252202 -0.0024825 0.0062868 0.0084015 0.1115079 0.1009062 0.0721116 0.0383198 0.0368927 -0.0369811 -0.1091173 0.0158079 -0.060063 0.0028588 0.1020681 -0.0742346 0.031398 -0.0367265 -0.0508998 0.104432 0.0127087 0.0551027 0.0173103 -0.2184817 -0.0012897 0.0090658 -0.001347 0.1135765 0.0014594 0.0052381 0.0016665 0.0779695 unknown
polarizability: 173.1982358|0.1450778|155.5641164|-4.2037114|2.3877866|71.3090888 unknown
InChI: InChI=1S/C8H9NO2S2/c1-2-9-7(10)5-6(8(9)11)13-4-3-12-5/h2-4H2,1H3
charge 0 multiplicity 1
22 atoms
S  -2.0339 1.847548 0.092346
S  -2.016534 -1.863383 0.041488
O  1.163797 2.359279 -0.135194
O  1.175241 -2.337055 -0.309317
N  1.55386 0.01334 -0.255454
C  -0.67278 0.685642 -0.0261
C  -0.669287 -0.685041 -0.075906
C  0.746027 1.175244 -0.134205
C  0.751261 -1.158157 -0.226024
C  3.023175 0.020994 -0.358572
C  -3.455106 0.628555 -0.232557
C  -3.379013 -0.660832 0.597913
C  3.712187 -0.035522 1.01971
H  3.311476 -0.85056 -0.972016
H  3.307358 0.942658 -0.896075
H  -3.47891 0.412569 -1.311862
H  -4.355614 1.203649 0.042717
H  -3.22744 -0.444156 1.66658
H  -4.30575 -1.246416 0.473272
H  3.431285 0.835997 1.635743
H  3.436481 -0.957526 1.559881
H  4.809585 -0.02673 0.891131
