program: Gaussian 09
title: 000036876
version: EM64L-G09RevD.01
frameworkgroup: C1[X(C15H23NO4)]
method: RPBEPBE
basis: SDD
operation: Freq
keyword: #p
keyword: freq=noraman
keyword: PBEPBE/SDD
title: #p freq=noraman PBEPBE/SDD
converged: YES YES NO NO
title: Mulliken charges:
elementType: O O O O N C C C C C C C C C C C C C C C H H H H H H H H H H H H H H H H H H H H H H H
charge: -0.277227 -0.247947 -0.198400 -0.268418 -0.092626 -0.382405 -0.385975 -0.312634 -0.251122 -0.682658 -0.695154 0.227391 -0.389973 0.336113 -0.330372 -0.346824 0.315687 -0.358254 -0.325101 -0.536844 0.205418 0.222026 0.223431 0.215669 0.187755 0.207020 0.232089 0.240207 0.218068 0.221101 0.221795 0.214063 0.214532 0.231078 0.238545 0.236432 0.242256 0.259104 0.238063 0.252937 0.244625 0.218401 0.218130
chargesum: 0.00000
title: Mulliken charges with hydrogens summed into heavy atoms:
elementType: O O O O N C C C C C C C C C C C C C C C
charge: -0.277227 -0.247947 -0.198400 -0.268418 -0.092626 0.045039 0.053125 0.082141 0.221175 -0.021693 -0.035481 0.227391 0.085004 0.336113 -0.088116 -0.087720 0.315687 -0.120192 -0.072164 0.144311
polarizability: 2.72466935e+02 -7.30748580e+00 1.80377333e+02 -4.22029544e+00 2.78879001e-01 1.17278577e+02
1716.lowfreq: -17.6370 -2.3460 -0.0013 0.0005 0.0008 2.0843 10.4303 13.3584 21.6573
frequency: -9.1472 13.2411 21.2714 28.3679 40.6663 51.3916 68.5136 82.3147 89.1835 110.6360 124.1504 156.8114 159.1373 166.2814 176.2792 203.2451 213.2030 235.6026 263.0127 267.8554 289.0339 298.8341 339.9339 361.8481 401.8125 418.8152 432.8697 479.7387 486.1400 505.1801 516.6787 533.4802 566.3161 630.4329 665.0214 715.8696 721.7152 747.7955 771.3625 786.5432 789.5685 801.8040 815.1837 831.6488 887.0134 895.7235 901.5990 925.9306 958.7418 974.1479 989.2627 997.1055 1004.0284 1031.5139 1039.5864 1063.3100 1066.8248 1084.8251 1092.1393 1109.7938 1112.0991 1114.1737 1123.7405 1154.6599 1163.1874 1177.1613 1199.3438 1203.7484 1205.5881 1233.7268 1238.4319 1271.0634 1286.5988 1297.6199 1316.4914 1331.9302 1341.2151 1356.1888 1368.7420 1376.0365 1382.0535 1386.0894 1387.7776 1426.4888 1435.5178 1454.3899 1456.7092 1464.7959 1465.6167 1468.0603 1472.9624 1473.9308 1478.4263 1481.5732 1488.3651 1496.9722 1497.1472 1589.8614 1626.7919 1678.6295 2864.0198 2912.3594 2951.0585 2952.5312 2977.2778 2986.2194 2992.3068 3008.4207 3013.6295 3021.0910 3037.1807 3039.1292 3044.3290 3073.4578 3078.4523 3081.4326 3091.6492 3094.6661 3122.0505 3146.8094 3157.3691 3167.3525 3178.3256
redmass: 3.4571 4.2083 5.1211 5.4694 4.2600 2.8516 2.8647 3.4781 3.5164 2.5732 2.7446 2.1572 3.8509 3.4203 2.4201 2.4328 1.3349 1.2000 3.8738 1.9055 1.8997 4.3188 4.7870 6.0600 2.3170 3.0488 4.1699 4.5538 2.9152 3.9178 2.3489 3.7749 3.3403 6.7399 5.9517 3.5354 4.8440 3.3986 1.1341 1.1754 1.3319 1.2987 4.2487 1.5616 5.7462 2.1566 1.3887 6.0420 1.3376 2.5077 7.3250 2.8370 1.8725 5.6074 2.4200 1.9295 1.8532 2.1711 2.9709 1.3189 1.2613 1.7121 3.1950 1.3364 1.4134 1.2254 1.1789 2.0439 2.5111 1.6893 6.1193 1.1154 1.2095 1.2872 1.3266 1.3389 1.2297 1.6738 1.3662 1.2925 1.8159 1.3407 2.1697 3.6935 1.1687 1.1170 1.0629 1.0504 1.0497 1.0681 1.0819 1.0523 1.0636 1.0562 1.0778 1.1931 1.8751 7.7234 6.4002 10.9203 1.0712 1.0693 1.0519 1.0376 1.0351 1.0370 1.0604 1.1024 1.0856 1.0592 1.1037 1.0973 1.0947 1.0990 1.1002 1.0996 1.1006 1.1089 1.0987 1.0868 1.0881 1.0954 1.0977
irintensity: 1.5834 0.0594 0.0944 0.0756 0.1402 0.0956 0.3816 0.4963 1.3588 0.8981 2.1490 0.4406 14.3298 0.4314 3.8441 5.1957 2.1592 0.2306 3.7823 0.6347 2.1749 21.6666 6.8610 0.2732 2.7187 0.0506 1.7617 3.1788 11.2550 8.1058 19.6182 2.5682 3.8100 0.2245 9.5476 0.0960 32.7884 17.6564 5.2068 4.0526 27.0011 8.0834 5.3242 74.4713 2.7887 5.9307 0.0049 50.9227 0.0273 10.8075 26.8638 15.2976 0.4775 196.1002 74.5511 13.9919 41.5323 43.4488 6.3059 72.6401 0.6370 68.0639 525.4725 0.2180 10.7927 16.3514 84.0851 47.9232 233.3631 20.0423 4.2491 0.5369 16.9262 3.5398 12.0814 3.4894 6.8304 17.2839 11.8854 16.1869 9.3008 26.3940 0.3453 2.6641 27.8108 89.3164 11.6829 13.1709 15.1385 14.3327 55.4408 3.2646 8.3442 5.1314 18.8032 41.2497 214.8646 8.3713 1.8738 186.8468 89.0004 65.4826 55.6788 63.3033 27.6237 25.0712 45.0304 21.4571 23.4962 15.9964 54.5169 6.1775 19.3605 45.5612 73.4358 38.1482 42.3992 34.0852 28.5872 21.1949 3.9647 12.0422 2.4724
temp: 298.150 k
press: 1.00000 atm
elementType: 8 8 8 8 7 6 6 6 6 6 6 6 6 6 6 6 6 6 6 6 1 1 1 1 1 1 1 1 1 1 1 1 1 1 1 1 1 1 1 1 1 1 1
symmnumber: 1
zpe: 938323.0 jmol-1
zpe.correction: 0.357388 hartree
zpe.thermalcorrener: 0.379138 hartree
zpe.thermalcorrenthalpy: 0.380082 hartree
zpe.thermalcorrgfe: 0.302993 hartree
zpe.sumelectzpe: -939.428966 hartree
zpe.sumelectthermal: -939.407216 hartree
zpe.sumelectthermalent: -939.406272 hartree
zpe.sumelectthermalfe: -939.483361 hartree
dipole: 1.7969 5.1888 0.7822
dipole: 5.5466
quadrupole: -99.3627 -119.6562 -121.9845
quadrupole: -10.4643 1.2281 -3.0209
quadrupole: 14.3051 -5.9884 -8.3167 -10.4643 1.2281 -3.0209
hfenergy: -939.7863543 hartree
pointgroup: C01 [X(C15H23N1O4)]
dipole: 0.7102515 -2.05843 0.1427862 debye
polarizability: 272.4929835|7.9716244|177.4255128|0.7022975|-13.4471084|120.2043487 unknown
InChI: InChI=1S/C15H23NO4/c1-4-16(5-2)10-11-19-15(17)12-20-14-8-6-13(18-3)7-9-14/h6-9H,4-5,10-12H2,1-3H3
charge 0 multiplicity 1
43 atoms
O  1.741077 -0.076047 0.173578
O  -1.689182 1.030884 -0.140793
O  0.870936 2.089517 0.032375
O  -7.097197 -0.553977 -0.150227
N  5.483775 -0.219156 0.051931
C  4.088036 -0.713624 0.099652
C  6.444895 -1.004725 0.864454
C  5.932421 0.127478 -1.321024
C  3.130021 0.479995 0.212124
C  6.770327 -2.434432 0.350919
C  7.189841 1.016005 -1.34529
C  0.704324 0.858857 0.095383
C  -0.615228 0.091726 0.121314
C  -3.003565 0.515639 -0.118705
C  -3.343276 -0.834332 0.120003
C  -4.022993 1.471859 -0.361898
C  -5.717733 -0.276778 -0.124279
C  -4.704505 -1.231317 0.117599
C  -5.368627 1.078825 -0.364873
C  -7.506868 -1.935792 0.097326
H  3.810402 -1.325716 -0.789514
H  3.956929 -1.360483 0.98606
H  7.381975 -0.424032 0.948224
H  6.033159 -1.070351 1.88976
H  6.107405 -0.783801 -1.946904
H  5.105614 0.67927 -1.807249
H  3.248767 1.196075 -0.620276
H  3.274329 1.022367 1.162189
H  7.462119 -2.941721 1.048942
H  7.253459 -2.410993 -0.642747
H  5.855989 -3.051547 0.272183
H  7.405769 1.339915 -2.379864
H  8.083126 0.483849 -0.971826
H  7.03463 1.913136 -0.720541
H  -0.576942 -0.713998 -0.64006
H  -0.726178 -0.385431 1.118235
H  -2.575824 -1.591561 0.307359
H  -3.734443 2.511278 -0.543489
H  -4.948649 -2.281229 0.30483
H  -6.168365 1.802047 -0.549647
H  -8.60492 -1.927701 0.032399
H  -7.196249 -2.2756 1.105418
H  -7.094081 -2.623779 -0.667152
