program: Gaussian 09
title: 000036844
version: EM64L-G09RevD.01
frameworkgroup: C1[X(C17H21N3)]
method: RPBEPBE
basis: SDD
operation: Freq
keyword: #pfreq=noraman
keyword: PBEPBE/SDD
title: #p freq=noraman PBEPBE/SDD
converged: YES YES NO NO
title: Mulliken charges:
elementType: N N N C C C C C C C C C C C C C C C C C H H H H H H H H H H H H H H H H H H H H H
charge: -0.149863 -0.134309 -0.111510 0.148504 0.427615 0.363360 -0.552290 -0.601000 0.186334 -0.837001 -0.819782 -0.842168 0.413074 0.155287 -0.334708 -0.318227 -0.367737 -0.316073 -0.645379 -0.646538 0.276892 0.249114 0.249347 0.228064 0.229083 0.221532 0.221986 0.236980 0.234565 0.228411 0.228407 0.238048 0.236049 0.243563 0.270848 0.238054 0.218006 0.238315 0.217998 0.238566 0.238581
chargesum: 0.00000
title: Mulliken charges with hydrogens summed into heavy atoms:
elementType: N N N C C C C C C C C C C C C C C C C C
charge: -0.149863 -0.134309 -0.111510 0.148504 0.427615 0.363360 -0.275398 -0.351886 0.186334 -0.130506 -0.139283 -0.150785 0.413074 0.155287 -0.096660 -0.082178 -0.124174 -0.045225 0.048995 0.048608
polarizability: 5.62017519e+02 -3.34217457e+00 2.06931291e+02 3.39630034e-02 3.21433834e-02 1.04136568e+02
1716.lowfreq: -7.4046 -0.0009 0.0003 0.0005 7.4444 7.9182 20.5045 31.5605 49.7280
frequency: 20.4260 31.5303 49.7188 67.1145 71.7631 75.9556 117.9598 129.1819 146.2824 160.0765 167.4401 186.7778 197.5018 202.8555 224.9410 246.7424 258.9055 266.8036 300.7942 335.9218 354.5874 386.3932 399.1308 417.8460 434.0264 472.7760 485.4507 521.4107 526.4353 529.7152 534.2609 563.7950 613.9647 631.8758 642.0281 717.0552 729.2856 746.0651 765.6973 806.3421 831.3215 870.5498 900.5071 915.1899 919.1273 941.1873 960.4120 967.8134 981.5837 989.1674 999.7395 1018.2979 1023.2253 1044.7123 1055.4466 1055.8043 1077.7059 1105.6840 1111.0605 1112.2456 1124.4800 1158.0219 1168.7975 1200.0497 1230.2889 1240.4867 1258.6568 1299.9766 1310.2784 1338.7347 1362.0784 1375.2823 1381.7624 1391.8969 1397.0696 1405.0821 1424.6683 1430.5722 1436.7994 1454.4471 1457.8611 1462.0892 1464.6334 1472.9522 1473.2648 1476.7350 1480.8871 1489.7434 1491.7431 1494.2289 1502.1148 1519.9010 1554.2528 1583.3769 1608.4984 1625.4259 2945.9269 2953.1106 2966.1116 2969.1146 2972.6824 3013.6458 3016.5464 3032.8959 3038.3539 3047.8971 3083.2390 3085.5285 3099.5698 3106.3895 3109.5619 3139.9803 3144.2918 3148.0768 3153.5148 3167.9807 3173.5434
redmass: 3.4505 4.1007 4.3971 1.2715 2.2442 2.4087 2.5412 1.9729 4.7062 1.9619 1.2426 1.1420 4.1837 1.1455 2.4062 3.1304 2.8932 3.6333 2.6515 2.6146 4.2812 3.9658 4.7350 4.3023 3.4269 3.8719 3.6872 2.9471 2.4063 5.1477 4.1723 3.7353 3.4658 6.7836 4.8864 4.2945 2.5677 3.5666 5.1921 1.2600 1.7620 6.2510 1.3588 2.6840 1.4877 3.0621 1.3613 2.6146 1.3348 2.8175 1.3727 1.4098 1.9054 1.5338 1.7036 1.5028 2.0138 1.2373 1.3261 2.0149 1.4359 1.4466 1.7166 3.0971 1.4628 1.9701 2.9949 3.1416 1.9213 7.0745 3.1205 5.2608 5.0870 1.2741 1.2934 1.2146 3.0687 1.2398 1.8425 2.6075 1.3232 1.0472 1.0401 1.0939 1.3370 1.0458 1.1905 1.0485 1.1628 1.1222 1.3905 1.8322 6.5203 6.9785 6.3352 6.2388 1.0366 1.0391 1.0380 1.0406 1.0377 1.0995 1.1027 1.0963 1.0968 1.0975 1.0981 1.0978 1.0965 1.0946 1.0945 1.0915 1.0881 1.0865 1.0911 1.0954 1.0950
irintensity: 0.8710 2.4921 2.2889 0.0537 0.0073 0.1304 1.4470 4.2976 0.2240 0.7708 0.1311 1.1422 0.0113 0.0481 0.3290 0.1890 3.9655 1.1926 0.5076 0.2121 7.9171 2.2596 0.4597 13.7447 0.0010 7.5886 6.3098 2.5679 12.7212 4.0387 7.9279 9.6129 4.9191 3.8736 0.3281 4.6598 4.7390 4.8448 0.0793 2.3421 74.9235 0.5546 5.3674 8.2356 19.8781 43.5408 1.8922 1.3949 1.1590 0.3209 6.8408 19.2277 28.2177 0.0058 4.2314 27.1077 7.1154 0.0035 1.1052 0.4087 4.5369 115.0984 120.4202 0.4892 1.6403 0.9747 26.2492 42.7789 6.2167 227.9277 246.2486 26.2036 8.5064 0.4524 13.9995 10.8637 2.7263 5.8606 9.7435 5.3863 24.7403 5.2606 0.0108 31.3506 21.9119 22.7541 21.1180 3.0819 16.4736 0.5261 4.4651 265.2458 49.3797 18.9581 1.0202 593.5353 96.6452 213.0592 62.8908 41.6565 52.0707 5.3543 76.6580 36.9566 8.3689 22.8375 21.1561 20.4752 3.9499 22.6465 51.3984 8.3026 6.0684 5.5205 3.4075 19.6431 26.3022
temp: 298.150 k
press: 1.00000 atm
elementType: 7 7 7 6 6 6 6 6 6 6 6 6 6 6 6 6 6 6 6 6 1 1 1 1 1 1 1 1 1 1 1 1 1 1 1 1 1 1 1 1 1
symmnumber: 1
zpe: 893208.0 jmol-1
zpe.correction: 0.340205 hartree
zpe.thermalcorrener: 0.360768 hartree
zpe.thermalcorrenthalpy: 0.361712 hartree
zpe.thermalcorrgfe: 0.289920 hartree
zpe.sumelectzpe: -823.168563 hartree
zpe.sumelectthermal: -823.148000 hartree
zpe.sumelectthermalent: -823.147056 hartree
zpe.sumelectthermalfe: -823.218848 hartree
dipole: -3.6823 -0.1408 0.0139
dipole: 3.6850
quadrupole: -61.4758 -108.7010 -125.5521
quadrupole: 1.7973 -0.0292 0.0075
quadrupole: 37.1005 -10.1247 -26.9758 1.7973 -0.0292 0.0075
hfenergy: -823.5087679 hartree
pointgroup: C01 [X(C17H21N3)]
dipole: 1.4492987 -0.0184679 -0.0325101 debye
polarizability: 561.484883|12.3863826|207.2118256|-7.8772124|3.2454166|104.3886697 unknown
InChI: InChI=1S/C17H21N3/c1-12-10-16(11-13(2)14(12)3)19-18-15-6-8-17(9-7-15)20(4)5/h6-11H,1-5H3
charge 0 multiplicity 1
41 atoms
N  5.822864 0.005176 -0.110941
N  -0.569984 -0.537484 -0.013722
N  0.167149 0.551802 0.010304
C  -4.819793 -0.074835 0.079106
C  -3.99696 1.100141 0.10434
C  -4.206242 -1.363069 0.023342
C  -2.594565 0.983085 0.074797
C  -2.795842 -1.454834 -0.005679
C  -1.980161 -0.297055 0.019711
C  -6.330458 0.082828 0.109935
C  -4.633408 2.479093 0.162601
C  -5.029521 -2.642845 -0.006326
C  4.432089 0.113795 -0.081907
C  1.56859 0.326096 -0.022599
C  3.787436 1.393725 -0.028971
C  3.596657 -1.056851 -0.104484
C  2.388966 1.486986 -0.000038
C  2.202719 -0.95129 -0.075529
C  6.655812 1.215445 -0.089336
C  6.46227 -1.316728 -0.171976
H  -1.9528 1.86951 0.093532
H  -2.29873 -2.430389 -0.049028
H  -6.854817 -0.884775 0.107975
H  -6.657606 0.640231 1.009346
H  -6.691194 0.661321 -0.763373
H  -5.298144 2.660402 -0.704428
H  -5.255177 2.60554 1.070373
H  -3.863818 3.268903 0.168665
H  -4.371339 -3.526742 -0.054404
H  -5.662874 -2.747489 0.895222
H  -5.703377 -2.680322 -0.883373
H  4.380223 2.312035 -0.011098
H  4.049664 -2.051604 -0.145168
H  1.894199 2.463516 0.040508
H  1.569953 -1.844367 -0.093119
H  6.456441 1.866314 -0.964503
H  7.718917 0.929995 -0.113585
H  6.484052 1.813932 0.827857
H  7.556295 -1.193356 -0.189483
H  6.167615 -1.874411 -1.083674
H  6.2038 -1.939225 0.708127
