program: Gaussian 09
title: 000036821
version: EM64L-G09RevD.01
frameworkgroup: C1[X(C8H5Cl2NO4)]
method: RPBEPBE
basis: SDD
operation: Freq
keyword: #p
keyword: freq=noraman
keyword: PBEPBE/SDD
title: #p freq=noraman PBEPBE/SDD
converged: YES YES NO NO
title: Mulliken charges:
elementType: Cl Cl O O O O N C C C C C C C C H H H H H
charge: 0.096059 -0.011766 -0.289328 -0.203971 -0.183701 -0.157011 -0.000610 0.403903 0.559570 -0.542886 -0.296275 -0.327205 -0.086299 0.181482 -0.494370 0.307343 0.307698 0.248091 0.250485 0.238789
chargesum: 0.00000
title: Mulliken charges with hydrogens summed into heavy atoms:
elementType: Cl Cl O O O O N C C C C C C C C
charge: 0.096059 -0.011766 -0.289328 -0.203971 -0.183701 -0.157011 -0.000610 0.403903 0.559570 -0.542886 0.011068 -0.019507 -0.086299 0.181482 0.242996
polarizability: 1.66355419e+02 -1.46600984e+00 1.70866512e+02 -3.60383864e+00 5.72146992e+00 6.06261639e+01
1716.lowfreq: -5.6470 -1.8374 0.0013 0.0020 0.0026 4.1306 27.8827 44.3476 57.4119
frequency: 27.8342 44.3461 57.4108 96.9449 107.0570 118.9621 143.4437 160.2849 199.9575 216.8873 256.5667 287.1369 298.2797 323.4918 336.7108 390.1411 406.5926 454.5716 522.5174 576.9908 605.8040 665.2116 677.6951 716.2838 721.0036 759.1167 814.3304 837.5658 905.4998 927.2907 945.0591 1027.4859 1096.3852 1114.3743 1122.8276 1148.2195 1184.5397 1210.8524 1237.3530 1365.9168 1369.9757 1383.2279 1422.1701 1427.6551 1452.2283 1462.9009 1564.4854 1579.6789 1641.8096 3009.1244 3113.1375 3156.1619 3185.6932 3196.7196
redmass: 6.9696 12.9686 14.2010 1.7041 2.4746 3.8129 5.6753 15.3661 5.1341 15.5673 6.7428 10.1829 7.1074 14.5582 8.6336 7.7913 10.0948 6.3565 5.4092 7.3179 6.2052 7.7923 9.1753 8.1485 7.5163 5.4179 7.9809 11.0997 1.5689 1.5201 6.9083 7.8291 4.8706 1.2828 1.8726 1.4593 2.9553 4.9696 2.7547 6.1574 4.9727 6.6692 1.4291 2.6321 1.0494 1.0513 7.9699 8.1664 10.7150 1.0295 1.1048 1.1051 1.0935 1.0929
irintensity: 0.9992 0.4993 0.3784 0.2898 0.2635 0.6823 5.0294 1.6540 4.6346 0.9697 5.5436 2.2515 2.2620 2.2589 6.1513 0.8944 3.1355 0.3271 26.1444 33.2309 0.9119 8.2680 27.4819 17.8356 0.6657 14.3112 3.9946 17.3022 25.8151 6.5824 19.0047 76.9602 223.5652 1.6367 53.1535 50.8502 71.6868 211.7538 102.9955 5.3610 26.4026 58.7756 78.4423 92.0423 15.8192 12.1286 30.4149 15.8603 149.2837 29.4570 20.7914 11.6910 9.1820 4.7319
temp: 298.150 k
press: 1.00000 atm
elementType: 17 17 8 8 8 8 7 6 6 6 6 6 6 6 6 1 1 1 1 1
symmnumber: 1
zpe: 317452.5 jmol-1
zpe.correction: 0.120911 hartree
zpe.thermalcorrener: 0.135427 hartree
zpe.thermalcorrenthalpy: 0.136371 hartree
zpe.thermalcorrgfe: 0.077056 hartree
zpe.sumelectzpe: -1582.427419 hartree
zpe.sumelectthermal: -1582.412903 hartree
zpe.sumelectthermalent: -1582.411959 hartree
zpe.sumelectthermalfe: -1582.471274 hartree
dipole: 4.4674 3.2982 0.4144
dipole: 5.5684
quadrupole: -93.9586 -107.3875 -100.0510
quadrupole: -1.9754 3.4642 -4.1242
quadrupole: 6.5071 -6.9218 0.4147 -1.9754 3.4642 -4.1242
hfenergy: -1582.54833 hartree
pointgroup: C01 [X(C8H5Cl2N1O4)]
dipole: -1.7888724 -1.2238518 0.3188099 debye
dipolederiv: 0.0455585 0.0157571 -0.0017731 0.0231191 -0.5889113 -0.0420058 -0.0019049 -0.0822491 0.0391776 -0.0988221 0.0531168 0.0011516 0.0677634 -0.8103903 0.0170233 0.0009621 0.0177551 -0.0380049 -1.429995 -0.1529488 0.2352401 -0.3738455 -0.525666 0.1858331 0.383655 0.1242019 -0.4110935 -0.7064121 0.2358767 -0.0439388 0.0286859 -0.6775704 0.2211906 0.085465 0.1610735 -0.3817865 -0.7833142 0.0289031 -0.2105279 -0.0225834 -0.357551 0.1607245 -0.1343271 0.1507514 -0.3973988 -0.4827305 -0.1783253 0.0139754 -0.1572048 -0.5033828 0.2768939 -0.0744914 0.2170279 -0.3999212 1.4303967 0.2996836 0.2272987 0.4450516 0.7082145 -0.5188902 0.2163559 -0.3942222 0.6306938 -0.462519 0.0404709 0.0179966 0.1055985 -0.2944038 0.0104016 0.0066189 0.0056434 0.0435628 -0.3268653 -0.0980802 -0.0102585 -0.1815078 -0.2184784 0.063793 -0.0120209 0.0080689 0.0486204 0.2074687 -0.0152747 -0.0199834 -0.0295151 0.9315266 0.0911534 0.0375333 0.141912 -0.0736257 0.0302181 0.0626352 -0.005029 -0.1021716 -0.2193098 0.0166296 0.0358899 -0.0079274 -0.0505002 -0.0263162 -0.012227 0.0140441 0.2153852 -0.2052085 0.0075176 -0.0744427 -0.0338106 -0.0415477 -0.1697251 -0.1112894 0.0024251 -0.1466911 1.3395934 -0.0364103 -0.0086126 -0.0535642 -0.0589941 1.8458596 -0.0993999 -0.1888228 0.1972718 0.9260087 -0.4508614 -0.3816406 -0.313363 0.4565252 0.7532894 0.0183089 -0.070817 -0.0535488 0.2182712 0.0241746 -0.0767727 0.0131073 0.2762807 0.1204813 -0.0393221 -0.0039394 -0.0555661 0.0962532 0.0005346 -0.0072744 0.0181157 0.1567324 0.0963575 0.0245579 0.0019819 0.0028667 0.1136415 -0.0099994 0.0179393 0.0270873 0.1654291 -0.0372297 -0.0023212 0.0018621 0.0635382 0.0971396 0.020334 -0.0815401 0.012265 -0.0876942 -0.0095691 -0.0285702 0.0004568 0.0764514 -0.0243821 -0.1141971 0.0085463 -0.0766699 0.0383888 0.0038682 -0.0415517 0.0386574 -0.1030976 -0.0053945 0.0761605 0.0600615 0.064797 0.0851562 unknown
polarizability: 166.3374865|-1.7092009|170.0505145|-1.872478|-11.5158815|61.4600938 unknown
InChI: InChI=1S/C8H5Cl2NO4/c1-15-8(12)5-2-4(9)3-6(7(5)10)11(13)14/h2-3H,1H3
charge 0 multiplicity 1
20 atoms
Cl 0.220162 2.612039 0.060982
Cl 0.66408 -3.806215 0.099861
O  -3.156374 -0.320337 0.535365
O  -2.581627 1.716693 -0.430641
O  3.857823 0.442879 0.56819
O  2.946472 1.943229 -0.89249
N  2.875556 0.918434 -0.122972
C  -0.853919 0.014857 0.023021
C  1.585126 0.173867 -0.044873
C  0.321437 0.819478 -0.024662
C  -0.730349 -1.398869 0.057433
C  1.707696 -1.230458 0.006972
C  0.537179 -2.000493 0.049352
C  -2.24201 0.596741 0.005251
C  -4.571757 0.126218 0.535622
H  -1.639402 -2.001665 0.100276
H  2.703272 -1.681158 0.018795
H  -4.913405 0.307681 -0.497065
H  -4.674443 1.054587 1.121246
H  -5.124518 -0.701608 1.000037
