program: Gaussian 09
title: 000002814
version: EM64L-G09RevD.01
frameworkgroup: C1[X(C19H18ClN3O5S)]
method: RPBEPBE
basis: SDD
operation: Freq
keyword: #p
keyword: freq=noraman
keyword: PBEPBE/SDD
title: #p freq=noraman PBEPBE/SDD
converged: YES YES NO NO
title: Mulliken charges:
elementType: Cl S O O O O O N N N C C C C C C C C C C C C C C C C C C C H H H H H H H H H H H H H H H H H H
charge: -0.018047 0.226427 -0.177463 -0.413225 -0.200496 -0.280164 -0.203795 -0.123761 -0.383784 -0.035131 -0.445798 -0.161772 -0.074753 -0.163325 0.092441 -0.689568 -0.656814 0.158181 0.173035 -0.123683 0.065083 0.276243 0.387576 -0.782860 -0.322346 -0.355775 -0.201064 -0.228792 -0.217570 0.310296 0.292158 0.309515 0.230523 0.243228 0.240415 0.242347 0.251725 0.221459 0.340458 0.386876 0.245500 0.301096 0.254055 0.263255 0.266658 0.240408 0.241026
chargesum: 0.00000
title: Mulliken charges with hydrogens summed into heavy atoms:
elementType: Cl S O O O O O N N N C C C C C C C C C C C C C C C C C C C
charge: -0.018047 0.226427 -0.177463 -0.026349 -0.200496 -0.280164 -0.203795 -0.123761 -0.043326 -0.035131 -0.135501 -0.161772 0.217405 0.146190 0.092441 0.024598 0.058716 0.158181 0.173035 -0.123683 0.065083 0.276243 0.387576 0.017791 -0.322346 -0.092520 0.065594 0.011616 0.023456
polarizability: 2.92850325e+02 3.31858205e+01 2.93198188e+02 1.07287364e+01 -1.17655253e+01 2.10625620e+02
1716.lowfreq: -4.6376 -0.0013 -0.0007 -0.0005 2.7839 7.2234 11.1298 22.8289 24.2419
frequency: 10.1460 22.7031 24.1682 34.3191 41.3524 47.3282 58.5230 63.5673 67.4859 78.0094 94.9161 103.1186 120.8588 131.5885 147.7554 167.2677 176.8049 211.4992 226.7140 234.9105 244.4499 254.5653 266.4864 279.4130 286.2062 292.3642 296.2829 322.8626 339.7098 360.2233 371.2200 385.9735 396.9247 418.3710 428.1572 447.4792 456.3671 475.3193 499.9206 520.8107 549.4658 559.7388 571.2994 583.7525 601.4007 621.9505 634.3481 672.7367 680.1155 687.2518 697.3270 717.6490 725.0772 739.0361 763.0269 772.2122 777.5116 786.0246 813.2767 832.2306 864.2515 874.7365 907.5397 942.4128 943.1245 945.8115 957.3560 962.9774 975.1093 989.1062 993.6530 1009.8154 1023.1134 1037.8221 1041.1891 1050.8336 1063.0753 1067.5223 1124.1576 1127.9040 1133.7528 1140.9354 1154.5294 1175.4572 1179.4444 1195.8758 1204.9485 1218.7597 1236.3845 1249.7754 1257.7165 1278.3177 1286.7754 1294.3258 1328.6426 1359.0105 1359.6817 1381.8700 1388.0153 1398.7660 1401.4123 1406.0180 1426.7612 1446.8417 1458.8515 1464.4499 1470.3585 1478.5642 1480.6915 1484.6963 1489.9389 1567.5468 1588.0216 1595.2953 1605.6283 1677.7310 1725.5859 2981.0066 2988.1845 2992.9005 3025.3446 3058.4436 3073.8772 3075.7220 3085.2808 3086.2144 3095.2882 3106.2059 3124.5232 3144.0665 3155.7514 3170.5340 3183.0334 3513.8997 3514.1666
redmass: 7.1227 6.8337 7.7377 8.9573 6.2398 6.6622 7.9943 2.0934 1.8882 3.9668 7.4560 7.5892 5.3314 6.7276 6.6776 6.4731 5.1518 3.6808 4.5901 2.9695 1.3788 3.6300 4.8041 4.3920 3.8955 1.2796 4.1105 7.2045 4.2691 4.2805 5.1038 4.1378 6.7102 8.0629 6.3152 5.3330 4.0194 4.7891 5.3622 3.7937 4.3693 4.4378 1.2222 3.4181 5.9052 1.5353 6.4800 7.5052 6.8888 4.0091 5.7697 7.0560 4.9315 5.4944 2.0790 2.4637 5.8055 7.5808 7.8342 4.8406 4.5313 1.3994 5.1732 4.1252 2.9837 1.4716 1.4267 2.9834 4.3900 3.8989 1.3372 1.3481 5.6680 2.7002 2.4917 1.5109 3.0897 2.4664 1.7790 1.7696 2.0099 1.5026 2.8761 1.0592 2.2302 2.0341 1.7277 2.3210 2.6343 1.7541 1.5553 1.6508 2.2042 5.4930 1.8476 6.5735 1.5831 3.6620 1.1939 1.4786 2.9001 1.1935 2.4853 1.1291 1.0494 1.0464 1.0607 1.0495 1.0562 1.9236 4.1719 6.1225 5.6805 7.6235 7.2183 9.0413 12.6642 1.0385 1.0357 1.0372 1.0843 1.0841 1.0974 1.0962 1.0903 1.0989 1.1007 1.1003 1.0991 1.0862 1.0913 1.0963 1.0994 1.0787 1.0642
irintensity: 0.3264 0.4085 0.3142 0.8301 1.8778 0.0368 1.4818 1.6478 0.5266 2.1659 4.1338 3.9238 4.5830 1.3935 0.0966 0.6077 5.0000 3.4033 1.0571 2.9269 2.4466 1.2962 3.4199 8.4323 1.7211 0.4393 1.6850 4.1435 0.3606 3.2307 10.0258 4.4264 5.6425 2.3728 5.6556 19.8114 9.4418 3.2622 2.3022 60.5485 19.1444 7.3606 62.9063 50.5043 1.0819 65.9018 6.7805 3.8512 4.9143 7.8946 48.9781 5.6513 5.3358 9.1337 56.2690 29.8771 11.3222 1.2801 20.7574 10.0176 17.2391 0.5423 44.3211 3.8445 1.6311 1.2785 4.9443 3.7176 17.1640 5.7711 0.0132 4.1008 34.5880 152.1869 60.5372 5.1328 7.3891 205.5859 3.0408 45.8555 28.3780 19.0995 34.1151 0.4054 12.6058 19.5214 46.7200 8.8488 24.1880 14.1042 15.6386 30.2395 19.0118 194.0246 14.3210 4.0663 17.9602 28.2844 27.7258 46.9658 4.9759 18.7259 46.6438 6.1117 0.1648 6.6006 24.1240 14.9094 0.3301 304.6042 13.4923 11.1831 150.0994 251.3361 8.0002 181.3620 388.8443 19.7385 19.0201 15.3355 5.4707 19.7738 6.3448 14.6746 12.5357 14.7316 15.1345 18.1132 1.3320 0.9539 7.2845 8.2371 6.7247 71.3286 36.0112
temp: 298.150 k
press: 1.00000 atm
elementType: 17 16 8 8 8 8 8 7 7 7 6 6 6 6 6 6 6 6 6 6 6 6 6 6 6 6 6 6 6 1 1 1 1 1 1 1 1 1 1 1 1 1 1 1 1 1 1
symmnumber: 1
zpe: 899944.1 jmol-1
zpe.correction: 0.342771 hartree
zpe.thermalcorrener: 0.370965 hartree
zpe.thermalcorrenthalpy: 0.371909 hartree
zpe.thermalcorrgfe: 0.280247 hartree
zpe.sumelectzpe: -2131.186069 hartree
zpe.sumelectthermal: -2131.157875 hartree
zpe.sumelectthermalent: -2131.156931 hartree
zpe.sumelectthermalfe: -2131.248593 hartree
dipole: 5.5237 1.4535 -3.0020
dipole: 6.4526
quadrupole: -172.5835 -171.2374 -186.0445
quadrupole: 5.2033 -2.2894 -0.1280
quadrupole: 4.0383 5.3844 -9.4227 5.2033 -2.2894 -0.1280
hfenergy: -2131.52884 hartree
pointgroup: C01 [X(C19H18Cl1N3O5S1)]
dipole: -2.1600272 -0.3993194 -1.2726327 debye
polarizability: 299.3119754|32.0229166|287.8334675|-6.1939461|12.9152287|209.5286897 unknown
InChI: InChI=1S/C19H18ClN3O5S/c1-8-11(12(22-28-8)9-6-4-5-7-10(9)20)15(24)21-13-16(25)23-14(18(26)27)19(2,3)29-17(13)23/h4-7,13-14,17,21,26H,1-3H3
charge 0 multiplicity 1
47 atoms
Cl 2.69176 -1.111096 2.49249
S  -3.033702 2.697674 0.084492
O  -1.496904 -1.159488 1.930002
O  -5.872923 -1.360068 -0.254704
O  -4.03913 -1.653082 -1.65752
O  1.48602 2.762987 0.855165
O  5.194988 1.30256 -0.822922
N  -2.521196 0.079695 0.106428
N  0.663407 0.70131 0.175463
N  4.840142 -0.126775 -0.834213
C  -1.823563 1.305577 -0.357481
C  -4.51014 1.482538 -0.30298
C  -3.979943 0.049517 0.164465
C  -0.665032 0.980189 0.667214
C  -1.549602 -0.25022 1.083804
C  -5.72914 1.918725 0.528062
C  -4.7983 1.542187 -1.818674
C  -4.572497 -1.07024 -0.696165
C  1.701688 1.611195 0.358807
C  3.048622 1.171274 -0.092753
C  3.56048 -0.156692 -0.389067
C  4.106096 2.04077 -0.363321
C  2.891912 -1.480459 -0.28886
C  4.278018 3.518389 -0.275143
C  2.426241 -2.020544 0.938654
C  2.72655 -2.269277 -1.460831
C  1.776369 -3.267413 1.007412
C  2.092573 -3.528303 -1.408121
C  1.607206 -4.021825 -0.175442
H  -1.549257 1.334534 -1.421764
H  -4.303135 -0.127026 1.207398
H  -0.602529 1.745608 1.459632
H  -6.082621 2.914571 0.207932
H  -6.555052 1.197895 0.385325
H  -5.487318 1.96522 1.604019
H  -5.041817 2.577908 -2.107317
H  -3.933508 1.211014 -2.419001
H  -5.663772 0.902084 -2.078107
H  0.860339 -0.219538 -0.224324
H  -6.260522 -2.085422 -0.815983
H  4.528462 3.947151 -1.262243
H  3.346411 3.963512 0.104987
H  5.102383 3.771202 0.41607
H  3.105689 -1.87473 -2.408921
H  1.411657 -3.637254 1.969247
H  1.973544 -4.116871 -2.323076
H  1.099546 -4.990562 -0.127033
