program: Gaussian 09
title: 000036828
version: EM64L-G09RevD.01
frameworkgroup: C1[X(C9H20N2O)]
method: RPBEPBE
basis: SDD
operation: Freq
keyword: #p
keyword: freq=noraman
keyword: PBEPBE/SDD
title: #p freq=noraman PBEPBE/SDD
converged: YES YES NO NO
title: Mulliken charges:
elementType: O N N C C C C C C C C C H H H H H H H H H H H H H H H H H H H H
charge: -0.301538 -0.065004 0.063082 -0.381039 -0.381192 -0.370195 -0.390126 -0.353455 -0.337227 -0.356489 -0.695641 -0.629344 0.196941 0.196546 0.189519 0.188856 0.189233 0.188620 0.224966 0.223635 0.189411 0.189037 0.222721 0.223966 0.194463 0.194769 0.210298 0.210261 0.215405 0.237076 0.275821 0.236626
chargesum: 0.00000
title: Mulliken charges with hydrogens summed into heavy atoms:
elementType: O N N C C C C C C C C C
charge: -0.301538 -0.065004 0.063082 0.012448 -0.002817 0.007658 0.058475 0.024993 0.109460 0.032743 -0.059678 0.120178
polarizability: 1.52709635e+02 4.72219335e+00 1.17255053e+02 1.55422453e-01 -8.83836725e-02 8.83187214e+01
1716.lowfreq: -2.7547 0.0007 0.0008 0.0009 7.7606 11.3084 32.2960 45.9208 47.6481
frequency: 31.8922 44.2709 46.1817 59.9683 67.1294 96.2902 107.5765 118.9293 143.3951 150.1750 187.4198 222.4127 230.9524 234.6479 318.7504 350.1098 373.2090 405.1848 448.0721 506.1980 674.8803 722.9297 728.8533 748.5336 791.4358 815.2904 860.6151 888.7400 938.1415 967.0290 991.3087 1010.1076 1025.7094 1042.0246 1064.4992 1077.8387 1080.6655 1092.8245 1115.3075 1154.3714 1156.0673 1190.5575 1220.9529 1228.6283 1251.9443 1264.1119 1274.7600 1278.7177 1285.2094 1294.7293 1298.7925 1308.7456 1335.6165 1341.7053 1355.8023 1359.2321 1376.6797 1391.1441 1402.4197 1459.1013 1462.3592 1462.9409 1465.9815 1470.5885 1477.0999 1477.7812 1478.4228 1483.6235 1488.6764 1492.5868 2946.6184 2950.4993 2952.7658 2954.9414 2963.2631 2968.9296 2972.8114 2977.4990 2985.7285 2989.5253 2992.7405 3004.1292 3008.8962 3023.4219 3039.3241 3063.8533 3069.5682 3071.0928 3072.9413 3097.5982
redmass: 3.4380 1.8300 4.0457 1.4526 1.5756 1.8782 2.0591 4.2811 2.0470 2.0021 4.3491 3.3886 1.1422 3.6563 3.6398 3.1014 6.8012 4.2007 2.9796 3.2482 4.8017 1.0609 1.0774 1.1151 1.1734 5.8085 1.2170 1.8981 1.2056 2.5461 4.9499 1.1217 3.5857 3.0608 3.0172 2.3751 2.1222 1.2682 2.2862 2.0726 1.9664 1.6266 1.4399 1.3601 2.2744 1.2331 1.6664 1.0477 1.0809 1.1191 1.0997 1.4157 3.0256 1.9285 1.6452 1.6458 1.4902 1.2179 1.2560 1.0630 1.0745 1.0695 1.0698 1.0790 1.0776 1.0422 1.0487 1.0846 1.0908 1.0921 1.0575 1.0587 1.0587 1.0591 1.0592 1.0588 1.0364 1.0326 1.0969 1.1029 1.0992 1.1022 1.0603 1.1045 1.1047 1.1019 1.1006 1.0994 1.1038 1.0992
irintensity: 0.1707 1.2986 1.5679 0.2639 0.0148 0.0564 0.0874 3.0412 0.0310 0.0018 0.8914 2.3434 0.0337 2.5204 4.4189 2.7890 1.8106 0.5580 0.6509 0.8188 1.2914 15.1313 0.2765 3.6205 0.2264 21.2952 0.9062 1.9942 0.3792 119.1079 5.2017 0.2081 14.5637 4.7296 10.6355 0.2518 0.1812 0.0121 9.2181 21.1027 18.0086 0.0445 18.8754 0.5667 8.2309 0.2607 3.4159 0.0024 0.3757 0.0838 0.0898 6.7740 99.7650 28.5674 0.9549 0.0022 12.3960 11.1779 26.2593 11.2705 0.9745 1.3774 0.1943 2.5462 0.4223 12.1921 24.1433 1.5892 12.7502 27.4358 12.2801 3.9675 23.4035 0.0184 15.8394 155.9483 37.6916 41.9860 0.5557 20.0125 4.0835 1.9640 26.3603 0.0263 116.5727 25.2833 79.0652 54.7840 80.4358 2.5195
temp: 298.150 k
press: 1.00000 atm
elementType: 8 7 7 6 6 6 6 6 6 6 6 6 1 1 1 1 1 1 1 1 1 1 1 1 1 1 1 1 1 1 1 1
symmnumber: 1
zpe: 740937.0 jmol-1
zpe.correction: 0.282208 hartree
zpe.thermalcorrener: 0.298050 hartree
zpe.thermalcorrenthalpy: 0.298994 hartree
zpe.thermalcorrgfe: 0.236857 hartree
zpe.sumelectzpe: -538.613373 hartree
zpe.sumelectthermal: -538.597531 hartree
zpe.sumelectthermalent: -538.596587 hartree
zpe.sumelectthermalfe: -538.658724 hartree
dipole: -1.8406 -4.2781 0.0201
dipole: 4.6573
quadrupole: -87.4060 -80.9253 -74.1990
quadrupole: -19.0713 0.1250 -0.0132
quadrupole: -6.5626 -0.0818 6.6444 -19.0713 0.1250 -0.0132
hfenergy: -538.8955813 hartree
pointgroup: C01 [X(C9H20N2O1)]
dipole: -0.7408053 -1.648386 0.3024473 debye
polarizability: 152.7923814|4.1725294|116.2828482|-1.4836749|-4.96509|89.2081798 unknown
InChI: InChI=1S/C9H20N2O/c1-3-4-5-6-7-8-9-11(2)10-12/h3-9H2,1-2H3
charge 0 multiplicity 1
32 atoms
O  4.884117 1.557196 -0.382941
N  3.670829 -0.314755 -0.042068
N  3.70395 1.049147 -0.290621
C  -1.411108 0.201911 -0.07061
C  -0.189684 -0.734889 0.066513
C  -2.762573 -0.533609 0.070824
C  1.153313 0.016275 -0.077507
C  -3.98388 0.404696 -0.057883
C  2.34175 -0.952216 0.072536
C  -5.337032 -0.32863 0.085753
C  -6.551072 0.61769 -0.037142
C  4.887289 -1.130348 0.107449
H  -1.372115 0.712413 -1.05523
H  -1.346263 1.001558 0.69615
H  -0.257507 -1.534479 -0.701079
H  -0.23191 -1.243448 1.052878
H  -2.830425 -1.330229 -0.699667
H  -2.799585 -1.048343 1.054046
H  1.202977 0.52081 -1.059635
H  1.225134 0.816029 0.682244
H  -3.949912 0.919522 -1.040945
H  -3.916895 1.201891 0.711851
H  2.288714 -1.457393 1.060052
H  2.273823 -1.748772 -0.698289
H  -5.368307 -0.845978 1.066595
H  -5.405352 -1.122383 -0.686164
H  -6.559514 1.12593 -1.019968
H  -6.5228 1.400702 0.74401
H  -7.505522 0.06962 0.067957
H  4.922904 -1.593105 1.11087
H  5.752907 -0.459533 -0.02312
H  4.91535 -1.928281 -0.657158
