program: Gaussian 09
title: 000036825
version: EM64L-G09RevD.01
frameworkgroup: C1[X(C9H9NO2S2)]
method: RPBEPBE
basis: SDD
operation: Freq
keyword: #p
keyword: freq=noraman
keyword: PBEPBE/SDD
title: #p freq=noraman PBEPBE/SDD
converged: YES YES NO NO
title: Mulliken charges:
elementType: S S O O N C C C C C C C C C H H H H H H H H H
charge: 0.312553 0.311012 -0.195408 -0.196455 -0.203287 -0.258327 -0.245062 0.226528 0.207671 -0.625423 -0.623362 -0.430958 -0.020924 -0.549255 0.267146 0.294386 0.266725 0.294288 0.246303 0.235766 0.243243 0.219208 0.223631
chargesum: 0.00000
title: Mulliken charges with hydrogens summed into heavy atoms:
elementType: S S O O N C C C C C C C C C
charge: 0.312553 0.311012 -0.195408 -0.196455 -0.203287 -0.258327 -0.245062 0.226528 0.207671 -0.063891 -0.062349 0.051112 0.222319 -0.106416
polarizability: 1.88626468e+02 8.46899087e+00 1.63182507e+02 3.55190787e+00 2.58222993e+00 8.00701620e+01
1716.lowfreq: -7.8362 -3.5971 -0.0017 -0.0016 0.0005 5.3320 27.5020 42.9307 60.9121
frequency: 27.0471 42.8033 60.8233 94.4609 96.7904 148.2422 180.6552 216.6334 230.8745 238.5687 265.4027 323.6138 356.3587 361.5083 373.3367 439.1769 459.7734 468.0807 586.1120 591.2507 620.3406 663.1882 713.1737 726.8055 733.8701 827.3331 849.0235 898.3786 900.8399 915.6843 932.8697 959.9502 1004.9259 1019.5591 1037.0661 1123.5639 1129.7896 1164.4092 1171.2162 1193.7155 1284.9008 1288.2608 1297.3005 1306.9205 1323.3766 1360.8936 1428.3378 1431.4983 1431.8271 1445.0994 1561.7339 1616.7835 1662.0161 1669.4990 3011.1789 3034.5912 3041.3026 3081.9148 3091.5834 3108.9646 3117.0900 3120.5903 3201.5987
redmass: 3.8913 4.0051 3.8082 3.6753 6.5301 5.6884 6.3106 7.7072 3.1841 4.0844 4.1958 6.6574 5.3427 5.1982 3.1589 3.7080 7.2183 3.2166 5.2404 5.5474 4.3441 2.4821 5.9972 9.7082 12.0484 3.4898 4.5088 2.5717 1.8607 1.6392 2.3849 1.3244 1.1504 3.3363 2.4526 9.7523 1.1831 4.5002 2.4573 1.1549 1.2475 1.2318 1.1974 1.3984 1.9936 2.1810 1.1762 1.0818 1.0827 1.1186 11.7014 12.5950 4.7008 11.8070 1.0608 1.0572 1.0594 1.0997 1.0613 1.1071 1.0961 1.1067 1.1148
irintensity: 0.4540 3.4481 1.4710 0.6655 0.2915 4.7054 1.3509 0.1891 4.6273 1.3097 0.0015 15.2628 0.3349 0.6240 0.3139 0.1078 3.6810 7.6171 1.1984 0.9921 1.8238 44.0060 3.8241 26.0094 0.1048 15.6662 8.3694 7.4198 15.7157 5.3213 12.6663 84.7716 16.3705 2.4876 25.8411 16.2636 19.1268 63.5546 4.9492 3.9247 8.9528 2.6402 32.6745 36.8433 198.6349 191.4002 8.4989 9.5190 14.4303 61.3708 130.9665 480.4524 6.9387 24.5061 21.2853 6.1495 25.7772 0.3164 7.9997 0.7464 6.1021 6.9762 20.5510
temp: 298.150 k
press: 1.00000 atm
elementType: 16 16 8 8 7 6 6 6 6 6 6 6 6 6 1 1 1 1 1 1 1 1 1
symmnumber: 1
zpe: 431041.3 jmol-1
zpe.correction: 0.164175 hartree
zpe.thermalcorrener: 0.178114 hartree
zpe.thermalcorrenthalpy: 0.179058 hartree
zpe.thermalcorrgfe: 0.121648 hartree
zpe.sumelectzpe: -1348.635620 hartree
zpe.sumelectthermal: -1348.621682 hartree
zpe.sumelectthermalent: -1348.620738 hartree
zpe.sumelectthermalfe: -1348.678148 hartree
dipole: 3.5637 -0.3437 0.7859
dipole: 3.6655
quadrupole: -72.0579 -114.3191 -93.9186
quadrupole: -1.2326 1.3405 -1.0190
quadrupole: 21.3740 -20.8872 -0.4868 -1.2326 1.3405 -1.0190
hfenergy: -1348.7997954 hartree
pointgroup: C01 [X(C9H9N1O2S2)]
dipole: 1.3991798 -0.1555548 0.3126816 debye
dipolederiv: -0.325314 0.3001068 -0.0217305 0.1847366 -0.1599219 0.0861529 -0.0155777 0.0090035 0.0208803 -0.372886 -0.2631614 -0.0658587 -0.1632525 -0.0867307 0.0358808 -0.1095941 -0.0724865 -0.0016469 -0.6394257 -0.3044729 -0.0853879 -0.1094985 -0.9229995 -0.1293075 -0.0734758 -0.1442815 -0.3448335 -0.621213 0.2719974 -0.0060551 0.0983005 -1.0439853 -0.0126065 -0.0405808 -0.0281394 -0.3215132 -1.3590997 -0.0097332 -0.0188894 0.0818649 -0.793342 -0.096092 -0.1182449 -0.0470961 -0.2933685 -0.3652218 -0.8295725 -0.0595293 -0.9065822 0.1854854 -0.1468452 -0.1671817 -0.1708665 -0.1423265 -0.1273459 0.8746296 0.0643045 0.9750348 -0.0958675 0.0933339 0.1159088 0.0934704 -0.0894394 1.3542294 0.388138 0.1573765 -0.2407472 1.2234427 0.1962331 0.1531365 0.2387014 0.3111168 1.346352 -0.3900333 0.0922584 0.1204903 1.374047 0.0604659 0.2132065 0.0866013 0.2904577 0.1948489 0.1022861 0.0727427 0.1425389 -0.0403156 0.0440539 0.1003597 0.0540932 0.102387 0.1927876 -0.1522596 -0.029047 -0.1877942 0.0027335 0.0072138 -0.0556416 0.0204138 0.0647263 0.8410162 -0.0249521 -0.0349479 -0.0775338 0.1232152 -0.0151573 0.0278058 -0.0799156 0.2515228 -0.1435466 0.1194344 -0.129297 0.1030868 -0.00501 0.1157197 -0.2219647 0.0836441 0.0362886 -0.3117928 0.0911619 -0.0921847 0.1088252 -0.0735351 0.1523814 -0.0367274 0.1399789 -0.0106146 -0.0439431 0.0602821 -0.0148279 0.0962871 0.0143515 0.0001377 -0.014525 0.0073876 0.1111935 0.0360961 -0.0100681 0.0177379 -0.0888985 0.0683 -0.0734979 -0.024217 0.0003274 -0.0689179 -0.0599001 -0.0477995 -0.0409461 -0.0763567 0.0385835 -0.0286006 -0.0434298 -0.0092952 0.0999824 0.0420173 0.0139511 0.0104396 0.1122358 0.0518663 -0.0420539 0.0609475 -0.002407 -0.0565378 -0.012517 -0.0364314 0.0426625 0.0871121 -0.0083347 0.1067468 0.0363606 0.0592031 0.0303323 0.0111479 -0.00263 -0.0026235 -0.0783722 0.0161038 -0.1189049 0.012956 -0.0368735 0.0374414 0.1342282 -0.081738 0.0025298 -0.0592446 0.0009428 -0.1018893 0.0494155 -0.0581409 -0.00189 0.0786687 -0.0362681 0.116872 -0.0606876 0.1127983 -0.0356583 0.1535763 -0.0234787 -0.0413837 0.1508133 -0.0328674 0.024401 -0.0615452 0.0181722 -0.0977065 -0.0025128 -0.119844 0.0161429 unknown
polarizability: 188.6110117|8.13685|162.6412196|4.8454104|6.9054613|80.6269057 unknown
InChI: InChI=1S/C9H9NO2S2/c1-2-3-10-8(11)6-7(9(10)12)14-5-4-13-6/h2H,1,3-5H2
charge 0 multiplicity 1
23 atoms
S  2.208362 -1.963795 -0.049736
S  2.466294 1.721713 0.303744
O  -0.966446 -2.17771 -0.688277
O  -0.663932 2.477038 -0.115242
N  -1.192475 0.183022 -0.46238
C  0.955696 -0.68706 -0.171374
C  1.046563 0.672702 -0.011203
C  -0.475439 -1.044654 -0.467828
C  -0.323343 1.27039 -0.18398
C  3.58586 -0.909995 0.726822
C  3.829811 0.428186 0.014954
C  -2.65113 0.302644 -0.657427
C  -3.414112 0.304315 0.656482
C  -4.331405 -0.632748 0.996474
H  4.479336 -1.55202 0.643501
H  3.343369 -0.762995 1.790705
H  4.734091 0.913785 0.419777
H  3.946553 0.292768 -1.071397
H  -2.827919 1.247256 -1.204881
H  -2.96844 -0.544346 -1.289789
H  -3.19023 1.137959 1.336697
H  -4.872543 -0.586318 1.948088
H  -4.562423 -1.476738 0.33497
