program: Gaussian 09
title: 000036808
version: EM64L-G09RevD.01
frameworkgroup: C1[X(C12H14Cl3NO)]
method: RPBEPBE
basis: SDD
operation: Freq
keyword: #p
keyword: freq=noraman
keyword: PBEPBE/SDD
title: #p freq=noraman PBEPBE/SDD
converged: YES YES NO NO
title: Mulliken charges:
elementType: Cl Cl Cl O N C C C C C C C C C C C C H H H H H H H H H H H H H H
charge: 0.001418 -0.010763 -0.011946 -0.255183 -0.295187 -0.022410 -0.545838 -0.447866 0.397107 0.383407 -0.062840 -0.331447 -0.332656 -0.681182 -0.698308 -0.114926 -0.230119 0.259305 0.267408 0.245644 0.240338 0.208413 0.247993 0.211848 0.217662 0.201544 0.230379 0.238530 0.211468 0.197600 0.280609
chargesum: 0.00000
title: Mulliken charges with hydrogens summed into heavy atoms:
elementType: Cl Cl Cl O N C C C C C C C C C C C C
charge: 0.001418 -0.010763 -0.011946 -0.255183 -0.047193 0.236895 -0.032786 0.000884 0.397107 0.383407 0.149008 -0.331447 -0.332656 -0.031597 -0.050710 -0.114926 0.050489
polarizability: 2.25766599e+02 -5.01381692e+00 1.92345843e+02 8.32859809e+00 6.94782854e-01 9.52683913e+01
1716.lowfreq: -5.4625 -4.7490 0.0018 0.0019 0.0020 9.0477 21.3607 29.1886 37.7348
frequency: 20.7073 29.0698 37.7051 62.9001 81.9303 128.7684 134.3380 147.4951 167.0122 182.4418 201.0239 211.8324 217.2329 252.8391 256.3861 286.0960 311.6822 346.0377 348.3724 387.4264 399.3929 453.2014 479.9073 496.2475 505.8061 533.2843 599.1065 619.0794 656.4078 668.9219 710.0180 733.5484 803.7335 841.2368 852.8771 893.1152 896.2982 912.2235 912.7588 920.8409 937.4960 955.6167 1044.0583 1098.4121 1121.8625 1127.5628 1130.4293 1146.9205 1167.0925 1174.9634 1193.8180 1226.1730 1240.0972 1262.9615 1272.5135 1310.2560 1322.7271 1345.5000 1352.3672 1368.7888 1378.1276 1391.6715 1417.1727 1424.2562 1450.1086 1460.4829 1463.7937 1465.2082 1476.8158 1483.6104 1484.0146 1572.9628 1603.9676 2901.5352 2967.4169 2974.5206 2982.1975 2984.5747 3036.7336 3049.5595 3062.2254 3071.0393 3072.8985 3076.9833 3096.6430 3179.7999 3426.6115
redmass: 5.1867 2.8528 4.8238 5.5229 6.5822 3.2878 8.0171 7.6457 4.6413 14.3245 2.6702 1.2039 3.3503 1.4889 2.7437 3.7133 16.8219 7.1068 5.3384 2.5454 3.7701 2.1875 3.5384 4.0624 3.6865 5.7313 10.8111 4.0814 2.7422 2.6971 5.5821 11.4728 2.9153 2.5862 1.3977 1.8372 8.6429 1.3146 3.7964 2.6150 1.4444 2.2857 1.6976 3.1578 2.6529 1.5362 2.2019 2.2353 2.1160 2.0602 1.7765 2.5509 1.5833 1.3011 1.5100 1.4231 1.2642 1.7978 3.4057 1.3725 1.3364 1.2297 4.0524 8.5540 1.1564 1.0998 1.0522 1.0551 1.0776 1.0807 1.0555 8.8929 11.1620 1.0697 1.0358 1.0451 1.0770 1.0674 1.0858 1.0919 1.0986 1.0993 1.0975 1.0957 1.1002 1.0928 1.0738
irintensity: 0.1244 0.1830 0.0914 0.3795 0.3499 1.3933 0.3697 0.3418 1.2907 0.0840 4.6452 0.6990 0.3752 2.1977 2.2288 7.0563 0.0180 0.8816 3.5148 3.2978 0.5151 1.2466 7.4362 11.2852 3.4279 16.9211 0.5351 27.0738 44.5046 38.2796 8.8836 56.6513 25.2336 32.8140 19.3111 27.0244 25.1689 3.9489 2.6275 36.7186 6.0147 37.9564 9.6395 10.0231 66.1070 75.1102 47.1006 3.6877 71.8561 58.6062 10.2664 21.8333 39.3573 8.2419 22.1608 6.4055 10.9863 16.3144 41.7485 24.3093 15.5738 28.5130 208.1428 11.1023 33.6154 15.8245 0.4932 8.6195 4.6771 17.0254 12.4107 5.0666 17.1759 60.9190 25.2816 18.5651 26.7888 20.4713 6.7788 29.4454 8.5141 38.4836 90.7601 15.6424 34.7744 1.0235 1.2480
temp: 298.150 k
press: 1.00000 atm
elementType: 17 17 17 8 7 6 6 6 6 6 6 6 6 6 6 6 6 1 1 1 1 1 1 1 1 1 1 1 1 1 1
symmnumber: 1
zpe: 618791.4 jmol-1
zpe.correction: 0.235685 hartree
zpe.thermalcorrener: 0.253600 hartree
zpe.thermalcorrenthalpy: 0.254544 hartree
zpe.thermalcorrgfe: 0.187224 hartree
zpe.sumelectzpe: -1974.532375 hartree
zpe.sumelectthermal: -1974.514460 hartree
zpe.sumelectthermalent: -1974.513516 hartree
zpe.sumelectthermalfe: -1974.580836 hartree
dipole: -3.8762 -1.0273 0.5209
dipole: 4.0437
quadrupole: -114.1671 -128.2283 -122.9316
quadrupole: 5.4226 -2.5111 -0.2130
quadrupole: 7.6086 -6.4526 -1.1560 5.4226 -2.5111 -0.2130
hfenergy: -1974.7680602 hartree
pointgroup: C01 [X(C12H14Cl3N1O1)]
dipole: 1.5346355 0.3556972 0.2221878 debye
polarizability: 225.6376354|-6.6456372|192.3901444|-4.7037746|-6.4197021|95.3530531 unknown
InChI: InChI=1S/C12H14Cl3NO/c1-6(2)16-5-7-3-8-11(15)9(13)4-10(14)12(8)17-7/h4,6-7,16H,3,5H2,1-2H3
charge 0 multiplicity 1
31 atoms
Cl -2.22922 3.083819 -0.242826
Cl -2.456272 -3.356377 0.122924
Cl -5.11563 1.520789 0.091117
O  0.06925 -1.480937 -0.230807
N  3.369936 0.344214 -0.170277
C  1.062359 -0.380437 -0.586087
C  0.312797 0.966234 -0.338874
C  2.323271 -0.606298 0.255675
C  -1.138021 0.532182 -0.229916
C  -1.18294 -0.881125 -0.148697
C  4.780646 -0.040805 0.11062
C  -2.320497 1.278243 -0.152166
C  -2.406605 -1.552746 0.012676
C  5.101141 -0.199271 1.622406
C  5.714395 0.990597 -0.553599
C  -3.556745 0.603467 0.00148
C  -3.60056 -0.804558 0.08617
H  1.299344 -0.516108 -1.656033
H  0.483067 1.683581 -1.158266
H  0.642806 1.447288 0.603318
H  2.687369 -1.632713 0.066256
H  2.049968 -0.551231 1.335788
H  3.180263 1.304703 0.150185
H  4.938229 -1.021886 -0.382033
H  6.138671 -0.552406 1.770626
H  4.993474 0.770048 2.147233
H  4.424851 -0.929197 2.1040
H  5.499687 1.065694 -1.633355
H  6.773499 0.70677 -0.419847
H  5.576802 1.993421 -0.102716
H  -4.560235 -1.314053 0.204727
