program: Gaussian 09
title: 000036843
version: EM64L-G09RevD.01
frameworkgroup: C1[X(C11H24N3S)]
method: RPBEPBE
basis: SDD
operation: Freq
keyword: #p
keyword: freq=noraman
keyword: PBEPBE/SDD
title: #p freq=noraman PBEPBE/SDD
converged: YES YES NO NO
title: Mulliken charges:
elementType: S N N N C C C C C C C C C C C H H H H H H H H H H H H H H H H H H H H H H H H
charge: 0.288072 -0.108720 -0.419698 -0.144371 -0.299862 -0.290825 -0.297529 -0.292787 -0.760176 -0.705433 -0.707537 -0.738730 -0.036700 -0.365447 -0.462520 0.329601 0.263420 0.249505 0.260868 0.265599 0.258059 0.251367 0.246871 0.287154 0.311187 0.265722 0.243819 0.242285 0.265690 0.248703 0.239589 0.253583 0.314167 0.231368 0.248002 0.249306 0.328975 0.245686 0.241741
chargesum: 1.00000
title: Mulliken charges with hydrogens summed into heavy atoms:
elementType: S N N N C C C C C C C C C C C
charge: 0.288072 -0.108720 -0.090723 -0.144371 0.293158 0.219547 0.226129 0.205451 -0.161834 0.046392 0.046444 0.060388 -0.036700 0.131861 0.024906
polarizability: 1.94054162e+02 -4.71636161e+00 1.49765548e+02 -6.94610848e+00 -4.88999917e-01 1.20005377e+02
1716.lowfreq: -8.5396 -7.0382 -0.0015 -0.0003 0.0008 1.8847 26.0708 50.8625 62.6558
frequency: 25.7650 50.8235 62.2644 72.1075 80.6983 93.4472 111.6468 125.1120 148.8615 173.3001 201.8121 215.2339 215.4388 228.1287 267.5205 285.5321 301.2228 321.0406 353.7615 356.9144 361.2998 373.9293 438.5005 445.4790 471.0068 549.3331 593.7502 655.7832 716.4220 725.2721 752.3849 777.0338 783.8219 809.5666 828.0032 854.7959 874.0758 875.9532 905.2283 936.8519 953.8539 1008.0048 1016.8050 1022.1201 1026.2678 1048.5035 1058.6105 1075.4985 1078.0204 1098.4157 1119.3424 1155.0216 1167.7441 1174.4262 1185.4112 1200.7958 1218.5429 1224.4999 1261.5114 1281.6733 1285.8668 1288.9018 1293.6141 1298.3300 1336.8250 1345.8268 1364.7519 1370.1955 1377.0405 1407.3175 1412.3843 1425.8674 1435.6385 1437.1737 1464.1884 1469.8354 1472.8285 1474.5662 1476.5723 1479.1729 1485.5326 1488.5290 1492.8608 1498.9424 1504.3383 1509.9297 1553.4714 2964.0983 3002.9343 3006.1098 3008.2960 3018.2539 3031.3715 3032.7004 3037.6382 3040.6162 3047.9877 3053.8609 3065.4601 3079.9839 3085.0631 3091.5030 3095.0218 3096.3961 3099.3711 3105.5400 3107.7654 3119.2927 3122.5475 3132.9946 3609.0923
redmass: 3.6679 2.6406 2.0251 2.9776 2.7542 2.3904 2.7780 2.9810 2.2054 2.6942 3.1253 3.2771 1.1920 2.2883 1.5306 1.4650 2.0010 2.0662 1.5863 1.9262 2.5245 3.8023 3.9498 4.8277 2.8954 2.7261 5.2351 3.4907 4.2589 4.8538 1.2891 1.2782 1.5757 1.2327 1.2115 1.9657 6.4867 1.7167 2.4930 5.8737 3.8256 1.8609 2.7283 2.3953 2.0641 2.5873 3.1308 1.5893 1.8312 1.7855 2.1691 1.6903 1.9148 1.1217 1.8548 2.2807 1.0908 1.3110 1.1945 1.4345 1.1312 1.1317 1.2424 1.1183 1.1751 1.2303 1.2812 1.2962 1.2913 1.2218 1.1848 1.1310 1.1671 1.8350 1.0633 1.0667 1.1272 1.0604 1.0518 1.0709 1.0480 1.0579 1.0713 1.0477 1.1127 1.0576 5.3232 1.0443 1.0577 1.0376 1.0376 1.0608 1.0601 1.0608 1.0599 1.0609 1.0572 1.1085 1.0965 1.1078 1.1001 1.1018 1.1019 1.0982 1.1005 1.1035 1.1052 1.1031 1.1038 1.1081 1.0811
irintensity: 0.1205 8.1431 2.9415 1.9967 0.1600 0.8805 1.0601 3.1694 0.1523 7.8807 4.8780 5.3997 0.4500 1.7069 1.2492 0.1182 1.7634 0.7737 84.5072 55.7906 11.8862 2.4673 4.3369 2.5534 2.1919 0.3311 0.5473 0.8931 4.1924 2.5621 18.0685 14.4724 47.0004 5.6238 2.2435 1.2695 16.5545 3.3222 5.9658 41.2706 3.8927 22.0292 6.9502 17.4007 21.1332 7.2167 9.4905 0.4073 2.0553 8.0887 1.8889 5.3640 8.8168 2.5028 8.9315 68.3951 0.6103 2.9178 11.3902 110.2283 2.6254 4.4011 11.9714 7.4384 8.7961 0.4336 10.5179 1.0121 2.0082 20.9004 37.3756 2.6613 40.8269 146.5137 4.5711 23.9220 0.4133 20.3778 18.5096 34.2958 9.5612 10.1231 7.5028 9.4742 15.0065 3.3069 153.1515 49.9319 40.0734 4.7532 4.8105 57.1779 5.2521 33.2953 8.2419 5.4469 9.2021 3.0954 11.2226 37.6408 6.8794 1.4203 1.2042 11.0196 0.3217 22.7802 2.5286 27.2622 20.4922 1.6406 70.1581
temp: 298.150 k
press: 1.00000 atm
elementType: 16 7 7 7 6 6 6 6 6 6 6 6 6 6 6 1 1 1 1 1 1 1 1 1 1 1 1 1 1 1 1 1 1 1 1 1 1 1 1
symmnumber: 1
zpe: 910947.9 jmol-1
zpe.correction: 0.346962 hartree
zpe.thermalcorrener: 0.365397 hartree
zpe.thermalcorrenthalpy: 0.366342 hartree
zpe.thermalcorrgfe: 0.300058 hartree
zpe.sumelectzpe: -994.399124 hartree
zpe.sumelectthermal: -994.380689 hartree
zpe.sumelectthermalent: -994.379744 hartree
zpe.sumelectthermalfe: -994.446028 hartree
dipole: 4.7999 0.8794 0.2117
dipole: 4.8844
quadrupole: -39.0858 -89.2474 -90.6634
quadrupole: -1.5732 -2.0968 0.8079
quadrupole: 33.9131 -16.2485 -17.6645 -1.5732 -2.0968 0.8079
hfenergy: -994.746086 hartree
pointgroup: C01 [X(C11H24N3S1)]
dipole: -1.8941189 -0.2799973 0.1634786 debye
polarizability: 190.1902826|12.5863481|127.6279038|13.0570591|-9.8092962|146.0069007 unknown
InChI: InChI=1S/C11H24N3S/c1-4-14(5-2,6-3)9-10-15-11-12-7-8-13-11/h12H,4-10H2,1-3H3
charge 1 multiplicity 1
39 atoms
S  1.67637 0.903019 -1.986647
N  -2.070512 -0.294262 -0.372726
N  3.877091 0.987637 -0.310471
N  2.073559 -0.141773 0.571703
C  -0.753225 0.468151 -0.684194
C  -2.952032 -0.307201 -1.648914
C  -2.784482 0.430647 0.799126
C  -1.778863 -1.76066 0.056229
C  0.181938 -0.216995 -1.691909
C  -4.362518 -0.885036 -1.480584
C  -3.257819 1.859791 0.506306
C  -0.819079 -1.917026 1.242395
C  2.581241 0.531073 -0.440167
C  4.404563 0.584487 1.020343
C  3.181684 -0.225721 1.600786
H  -0.206402 0.58146 0.266664
H  -1.050287 1.461145 -1.058269
H  -2.390528 -0.890491 -2.397858
H  -2.998165 0.737238 -1.999326
H  -2.062708 0.429433 1.63136
H  -3.634043 -0.211817 1.085702
H  -1.378803 -2.262823 -0.841101
H  -2.760322 -2.20822 0.285708
H  -0.254544 -0.350636 -2.694555
H  0.584384 -1.167882 -1.312732
H  -4.869382 -0.818597 -2.459529
H  -4.363602 -1.948933 -1.193222
H  -4.978085 -0.319387 -0.761791
H  -3.746227 2.241868 1.420189
H  -2.430293 2.550598 0.27628
H  -4.005766 1.91291 -0.302227
H  -0.63456 -2.99861 1.374721
H  0.160261 -1.43043 1.075467
H  -1.251682 -1.552767 2.189637
H  4.653841 1.468958 1.633342
H  5.309355 -0.039592 0.915154
H  4.424355 1.456258 -1.029548
H  3.436348 -1.286039 1.773518
H  2.826142 0.199523 2.554739
