program: Gaussian 09
title: 000036919
version: EM64L-G09RevD.01
frameworkgroup: C1[X(C9H12ClO4P)]
method: RPBEPBE
basis: SDD
operation: Freq
keyword: #p
keyword: freq=noraman
keyword: PBEPBE/SDD
title: #p freq=noraman PBEPBE/SDD
converged: YES YES NO NO
title: Mulliken charges:
elementType: Cl P O O O O C C C C C C C C C H H H H H H H H H H H H
charge: -0.042491 1.414603 -0.521905 -0.516373 -0.498790 -0.580946 -0.212785 -0.313847 -0.446743 -0.275931 0.441778 -0.197232 -0.298105 -0.484775 -0.481186 0.247682 0.259350 0.234914 0.242429 0.251804 0.293587 0.243991 0.258200 0.242565 0.255866 0.242293 0.242048
chargesum: 0.00000
title: Mulliken charges with hydrogens summed into heavy atoms:
elementType: Cl P O O O O C C C C C C C C C
charge: -0.042491 1.414603 -0.521905 -0.516373 -0.498790 -0.580946 0.034896 -0.054497 0.030600 -0.024127 0.441778 0.096355 -0.298105 0.259981 0.259021
polarizability: 1.62271975e+02 -1.02248519e+00 1.42380123e+02 2.89961359e+00 2.70958761e+00 1.09428900e+02
1716.lowfreq: -6.0634 -0.0027 -0.0020 -0.0016 0.9642 7.8165 14.4894 17.6882 65.3751
frequency: 12.4225 16.5513 65.3543 68.0623 94.3540 96.3489 105.6045 109.9063 132.1572 145.4207 155.4474 194.4950 238.2899 244.2109 281.4107 305.4446 340.8441 352.4648 381.8016 408.0461 429.2441 468.6997 497.3135 601.3828 620.7073 681.6033 704.0952 741.7906 773.8206 815.6445 862.8638 873.9166 915.7000 934.0203 961.8282 963.5050 974.7149 1009.6786 1024.7834 1071.3149 1081.3707 1111.5773 1116.1375 1118.0950 1128.7367 1132.5493 1137.0299 1143.1556 1174.8053 1192.7194 1241.6420 1263.8660 1274.9792 1300.6543 1423.1598 1425.5782 1454.8841 1461.0151 1463.2590 1471.7833 1474.0368 1566.7290 1675.5376 2987.9382 2993.2415 2999.4809 3025.2798 3035.0924 3055.9951 3100.7424 3109.9564 3138.3571 3140.1042 3160.9165 3213.2344
redmass: 5.1705 5.9571 3.5485 2.9904 1.5722 1.5665 2.1062 2.0413 3.9145 4.6723 7.0025 4.2780 3.4526 6.9088 6.0962 5.2803 5.7576 6.2128 7.0729 6.1464 3.5973 5.2149 9.3882 6.4246 6.2546 6.1694 9.2230 7.0177 1.6024 2.2244 2.4970 2.2451 3.0255 1.8547 10.6791 8.2324 2.3800 2.0506 1.3442 14.2691 1.9497 1.2358 1.2686 1.9843 1.2805 1.2946 2.0066 1.3928 2.0082 1.4073 1.4317 2.0197 2.8355 1.6292 1.1218 1.1224 1.0518 1.0495 1.0939 1.0537 1.0539 5.6503 9.1572 1.0590 1.0292 1.0288 1.0858 1.1011 1.0897 1.1065 1.1051 1.1039 1.1054 1.0907 1.1142
irintensity: 1.0807 2.0954 9.9210 6.3952 0.1411 0.4445 0.2630 0.5353 4.3828 0.8085 3.2225 1.5176 6.3855 2.3553 9.7584 15.3876 8.2443 17.3768 46.2740 11.1127 0.7849 16.5843 38.6289 34.0747 48.1121 97.9760 96.0564 142.6860 129.5923 3.1479 1.5501 21.8657 33.0464 21.3288 238.6541 86.9463 35.1715 26.7660 3.8481 142.2420 22.9736 0.4322 1.9583 20.0072 1.0938 0.4883 16.8133 4.7211 94.7353 33.3809 7.9030 16.0006 118.1021 6.2157 3.0907 1.7105 10.0091 14.5371 3.4228 13.5162 19.0636 1.2938 45.4630 40.2853 37.4320 34.9144 23.9124 6.2268 51.1686 17.3912 24.5601 11.8323 10.8768 10.6308 9.8509
temp: 298.150 k
press: 1.00000 atm
elementType: 17 15 8 8 8 8 6 6 6 6 6 6 6 6 6 1 1 1 1 1 1 1 1 1 1 1 1
symmnumber: 1
zpe: 517198.9 jmol-1
zpe.correction: 0.196991 hartree
zpe.thermalcorrener: 0.214232 hartree
zpe.thermalcorrenthalpy: 0.215176 hartree
zpe.thermalcorrgfe: 0.148776 hartree
zpe.sumelectzpe: -1451.081235 hartree
zpe.sumelectthermal: -1451.063993 hartree
zpe.sumelectthermalent: -1451.063049 hartree
zpe.sumelectthermalfe: -1451.129449 hartree
dipole: -0.5325 1.1740 2.2355
dipole: 2.5806
quadrupole: -91.4027 -106.4014 -97.5814
quadrupole: 10.6073 4.3863 -8.1873
quadrupole: 7.0591 -7.9395 0.8804 10.6073 4.3863 -8.1873
hfenergy: -1451.2782253 hartree
pointgroup: C01 [X(C9H12Cl1O4P1)]
dipole: -0.1858064 0.9747466 0.2147992 debye
polarizability: 160.931249|1.9099157|126.6748614|7.2534093|-16.7147182|126.4748886 unknown
InChI: InChI=1S/C9H12ClO4P/c1-12-15(11,13-2)14-9-7-4-3-6(7)5-8(9)10/h3-4,6-7H,5H2,1-2H3
charge 0 multiplicity 1
27 atoms
Cl -1.084609 2.154682 -2.301574
P  1.852223 -0.600618 0.190127
O  0.660829 0.661335 -0.131934
O  3.161967 0.091217 -0.675662
O  2.350732 -0.332318 1.798478
O  1.40882 -2.089685 -0.099397
C  -2.99096 -0.209503 0.531473
C  -1.445428 -0.429756 0.904077
C  -3.054613 0.823305 -0.644268
C  -2.99025 -1.703239 0.166343
C  -0.727288 0.453198 -0.095272
C  -1.6770 -1.904273 0.488707
C  -1.592854 1.083285 -0.931952
C  3.037938 0.255216 -2.14818
C  2.881234 0.996851 2.205254
H  -3.635243 0.078365 1.378698
H  -1.138699 -0.252107 1.950583
H  -3.579259 1.754624 -0.35823
H  -3.575991 0.409643 -1.528783
H  -3.775719 -2.348551 -0.235831
H  -0.982191 -2.74417 0.445123
H  3.996377 0.697463 -2.45566
H  2.201163 0.934096 -2.386673
H  2.897017 -0.725733 -2.634724
H  3.825244 1.205918 1.676579
H  3.051135 0.896901 3.287113
H  2.140624 1.789454 1.999784
