program: Gaussian 09
title: 000036891
version: EM64L-G09RevD.01
frameworkgroup: C1[X(C17H20N3O)]
method: RPBEPBE
basis: SDD
operation: Freq
keyword: #p
keyword: freq=noraman
keyword: PBEPBE/SDD
title: #p freq=noraman PBEPBE/SDD
converged: YES YES NO NO
title: Mulliken charges:
elementType: O N N N C C C C C C C C C C C C C C C C C H H H H H H H H H H H H H H H H H H H H
charge: -0.264512 -0.136572 -0.376514 -0.318570 0.300222 0.251321 -0.236520 -0.056797 -0.374055 -0.263007 -0.284429 -0.301213 -0.495449 -0.195915 0.425857 -0.181276 -0.442795 -0.369629 -0.215484 -0.219811 -0.236165 0.238605 0.222772 0.313397 0.375967 0.230112 0.207966 0.204419 0.234921 0.275941 0.204394 0.231668 0.269491 0.265895 0.262077 0.265065 0.234230 0.252653 0.234105 0.230547 0.237089
chargesum: 1.00000
title: Mulliken charges with hydrogens summed into heavy atoms:
elementType: O N N N C C C C C C C C C C C C C C C C C
charge: -0.264512 -0.136572 -0.000548 -0.052675 0.300222 0.251321 0.224857 0.256600 0.064023 0.176334 -0.008488 -0.031722 -0.059387 0.066162 0.425857 0.083789 -0.208566 -0.116976 0.018621 0.010736 0.000924
polarizability: 3.33612141e+02 1.25652326e+00 2.06826394e+02 2.84920677e+01 2.40173333e+00 1.27173839e+02
1716.lowfreq: -6.4205 -1.4489 -0.0008 -0.0008 0.0001 3.9056 12.7867 15.1475 25.2973
frequency: 12.5747 14.7152 25.2816 28.3662 47.9171 59.5176 81.6229 97.4300 124.6814 147.5407 175.8494 213.5430 222.8860 242.9338 262.0193 304.0512 369.3283 394.5898 404.8216 415.3273 454.0195 475.4744 501.1911 533.4640 566.9846 593.8371 600.3026 616.6217 631.2103 671.7260 695.1750 706.3003 742.1531 752.2559 756.4220 765.5242 767.7363 806.0836 822.7590 835.3634 857.9865 863.6875 877.5859 910.7239 918.0597 958.0452 967.2682 980.8959 990.3198 998.3104 1003.4440 1005.2692 1011.0078 1026.2446 1029.4306 1040.0590 1079.6045 1083.8051 1092.0477 1119.7167 1127.1690 1144.4224 1157.8238 1168.0943 1174.2402 1178.2280 1184.7202 1192.6912 1214.7236 1230.9566 1241.3667 1271.6406 1273.8494 1295.8551 1307.3563 1320.5596 1341.1972 1348.9978 1377.1255 1390.4365 1406.7480 1410.7914 1423.9842 1441.7056 1454.1435 1459.6822 1470.3201 1479.1212 1481.7863 1486.1836 1491.7393 1495.7519 1541.4014 1595.5000 1615.2016 1617.1750 1629.6079 2893.3018 2901.8428 2948.3462 2955.5773 2982.4579 2997.8470 3028.6861 3051.8005 3119.1865 3129.0556 3142.1011 3152.5140 3162.0421 3167.9136 3171.2928 3184.4797 3194.7467 3264.1503 3451.0354 3577.8248
redmass: 4.7810 3.8325 4.6660 4.0463 4.7678 3.6699 2.1039 3.8028 4.6624 2.9787 4.7928 3.9346 3.7889 3.4290 3.1892 3.5924 4.5949 3.7546 2.8252 2.8967 3.6688 3.4552 4.2253 6.0072 3.5042 4.1250 4.5880 6.2180 4.2032 1.3179 1.1703 1.9191 4.6083 1.6537 4.2666 1.2918 4.9857 1.7248 1.7612 1.4722 1.2456 1.4122 5.4468 6.9663 1.3482 1.3653 2.0529 1.3909 6.1636 1.5810 1.3552 1.6230 2.0773 2.2208 5.2766 2.2989 3.0823 1.6099 3.2195 1.7448 1.6833 3.7469 1.2796 1.1025 1.0581 1.1689 1.1070 1.1671 2.3865 1.3654 2.2653 1.4736 1.1385 1.3534 2.8924 1.3338 1.4329 1.5536 1.9352 2.7265 2.5915 1.6610 3.7516 2.1121 1.2132 2.4375 1.0979 1.3772 1.3486 1.4475 1.1241 1.9673 4.3328 6.1139 6.1329 7.1276 7.0933 1.0690 1.0702 1.0549 1.0591 1.0904 1.1091 1.0952 1.0993 1.0880 1.0861 1.0912 1.0960 1.0882 1.1015 1.0919 1.0973 1.0997 1.1026 1.0749 1.0835
irintensity: 0.1788 1.0402 0.5553 0.5428 2.1642 4.1018 4.7042 4.8463 5.4739 7.3176 1.8637 8.6466 7.8148 4.4571 0.2189 1.9002 2.0361 3.6472 0.4747 12.3480 12.3849 3.1509 5.4797 1.4925 2.5342 1.9351 7.4140 1.3330 2.9141 110.6703 99.7762 47.2019 4.2845 66.6343 2.3146 148.0771 12.9589 1.3802 4.1097 2.0964 0.1104 0.7975 0.4301 57.6396 11.0477 1.9526 2.6788 0.7583 0.2207 23.8016 0.1549 20.6691 3.0589 2.4048 196.8815 35.1135 4.4477 14.0354 9.2550 9.4048 28.1903 95.0588 5.7868 2.4501 0.2304 3.9935 1.3645 11.6620 1.7528 23.4938 15.2965 15.6966 1.1189 25.6988 2.1701 2.7838 4.7739 0.9465 25.3469 35.1618 42.9714 6.5567 3.8913 11.8512 48.4588 18.5318 1.1521 11.8225 15.5538 4.2837 5.2318 3.9309 64.9607 1.0009 3.6045 19.2278 5.0318 49.2349 95.7777 31.5909 55.6360 25.5383 21.6407 9.0659 43.9652 9.8355 0.8157 13.1435 34.7964 0.5619 19.1016 1.0802 1.0739 0.3283 34.9574 3.6215 216.8425
temp: 298.150 k
press: 1.00000 atm
elementType: 8 7 7 7 6 6 6 6 6 6 6 6 6 6 6 6 6 6 6 6 6 1 1 1 1 1 1 1 1 1 1 1 1 1 1 1 1 1 1 1 1
symmnumber: 1
zpe: 895235.0 jmol-1
zpe.correction: 0.340977 hartree
zpe.thermalcorrener: 0.360129 hartree
zpe.thermalcorrenthalpy: 0.361073 hartree
zpe.thermalcorrgfe: 0.288270 hartree
zpe.sumelectzpe: -897.516291 hartree
zpe.sumelectthermal: -897.497139 hartree
zpe.sumelectthermalent: -897.496195 hartree
zpe.sumelectthermalfe: -897.568997 hartree
dipole: 17.6322 -3.3223 -0.2465
dipole: 17.9442
quadrupole: -1.2794 -90.8373 -117.7768
quadrupole: -17.1882 12.1168 -2.9360
quadrupole: 68.6851 -20.8728 -47.8123 -17.1882 12.1168 -2.9360
hfenergy: -897.8572679 hartree
pointgroup: C01 [X(C17H20N3O1)]
dipole: 6.8866058 1.5277315 0.2853427 debye
polarizability: 333.1202996|7.8405518|204.6179537|-29.1795923|13.3214004|129.8741212 unknown
InChI: InChI=1S/C17H20N3O/c1-2-6-15(7-3-1)12-18-10-11-21-14-20-13-19-16-8-4-5-9-17(16)20/h1-9,13,18-19H,10-12,14H2
charge 1 multiplicity 1
41 atoms
O  1.082028 0.772722 0.054097
N  3.330459 1.283666 0.419898
N  5.275282 1.742504 -0.538664
N  -2.546379 -0.084298 -0.039455
C  4.019266 0.048458 0.294228
C  5.275149 0.345905 -0.313453
C  1.969671 1.449348 0.964345
C  4.102873 2.273598 -0.099848
C  -1.156507 0.00066 -0.515184
C  -0.329625 0.74759 0.539138
C  3.658509 -1.267488 0.644622
C  6.230929 -0.6541 -0.581468
C  -3.577276 -0.297619 -1.088426
C  4.614257 -2.267915 0.380692
C  -4.976744 -0.347353 -0.487938
C  5.874819 -1.96788 -0.21815
C  -5.884125 -1.366797 -0.867472
C  -5.398917 0.639058 0.440615
C  -7.194907 -1.39842 -0.337278
C  -6.705604 0.606467 0.974821
C  -7.608831 -0.4115 0.58573
H  1.941489 1.002058 1.981282
H  1.759099 2.536878 1.041928
H  3.825348 3.322571 -0.155604
H  6.031479 2.27996 -0.966114
H  -1.142448 0.581323 -1.455663
H  -0.676157 -0.982117 -0.734489
H  -0.368624 0.230173 1.522009
H  -0.710032 1.780611 0.659013
H  2.683237 -1.505297 1.075083
H  -3.400602 -1.226616 -1.680982
H  -3.499317 0.550335 -1.799452
H  7.1955 -0.433623 -1.04704
H  -2.667156 -0.742534 0.741543
H  4.382155 -3.306888 0.632653
H  6.58066 -2.782429 -0.405067
H  -5.567547 -2.137754 -1.581165
H  -4.694367 1.423142 0.739247
H  -7.887932 -2.190709 -0.640749
H  -7.023359 1.374359 1.689108
H  -8.623453 -0.43475 0.998108
