program: Gaussian 09
title: 000036921
version: EM64L-G09RevD.01
frameworkgroup: C1[X(C15H16N2O6S2)]
method: RPBEPBE
basis: SDD
operation: Freq
keyword: #p
keyword: freq=noraman
keyword: PBEPBE/SDD
title: #p freq=noraman PBEPBE/SDD
converged: YES YES NO NO
title: Mulliken charges:
elementType: S S O O O O O O N N C C C C C C C C C C C C C C C H H H H H H H H H H H H H H H H
charge: 0.187664 0.288455 -0.167744 -0.413529 -0.199241 -0.244731 -0.399529 -0.224714 -0.079592 -0.362292 -0.478714 -0.123555 -0.179964 -0.158083 0.104915 -0.673845 -0.670453 0.177666 0.221341 -0.412184 0.497610 0.197440 -0.215423 -0.775949 -0.545803 0.332469 0.303353 0.313155 0.234300 0.231757 0.250763 0.221065 0.239705 0.256179 0.357793 0.289721 0.387414 0.292727 0.287553 0.269612 0.382689
chargesum: 0.00000
title: Mulliken charges with hydrogens summed into heavy atoms:
elementType: S S O O O O O O N N C C C C C C C C C C C C C C C
charge: 0.187664 0.288455 -0.167744 -0.026115 -0.199241 -0.244731 -0.016841 -0.224714 -0.079592 -0.004499 -0.146245 -0.123555 0.123389 0.155072 0.104915 0.042976 0.046496 0.177666 0.221341 -0.122463 0.497610 0.197440 0.077304 -0.488396 -0.276192
polarizability: 2.38892984e+02 2.78576078e+01 2.21310806e+02 6.68169226e-01 2.93472718e+00 1.90226023e+02
1716.lowfreq: -5.0880 -1.3150 -0.0022 -0.0021 -0.0015 2.7738 8.7736 23.3950 29.7202
frequency: 8.5861 23.2193 29.5306 34.0309 46.7070 50.3424 60.2501 64.7692 70.5798 103.6337 108.2561 127.4758 138.8354 148.7383 196.8083 215.4441 226.6948 240.8627 258.6433 271.0619 284.5547 292.6398 305.1336 312.8123 322.9400 339.9683 362.2515 383.5643 427.8933 444.4156 470.0659 484.4936 522.7055 527.8751 544.2943 567.5006 578.8445 584.2173 609.4651 616.8434 642.4241 651.7996 661.4440 668.4825 687.2152 700.0573 717.8928 732.4978 753.6741 772.5586 795.5112 800.9031 806.1107 835.6224 862.3523 885.6184 899.8862 910.7694 932.0423 939.6863 948.1739 958.4672 964.9581 983.9812 1011.4085 1036.8562 1052.5230 1073.8204 1100.2735 1115.5275 1143.4510 1154.3951 1169.5724 1179.1273 1192.4702 1201.3340 1214.5590 1220.3721 1223.6609 1231.0167 1243.3659 1254.9135 1265.0980 1278.9873 1314.4917 1334.9224 1359.5953 1378.3224 1387.8235 1405.7646 1456.9214 1457.3416 1464.7504 1474.3963 1480.3256 1485.2995 1545.2562 1615.2566 1666.5828 1668.2928 1728.1975 2978.8244 2988.3801 3043.3144 3054.9925 3067.9895 3074.9932 3085.2110 3097.6821 3101.2425 3124.5495 3187.1559 3223.5188 3242.1621 3476.7432 3507.6703 3508.5750
redmass: 7.4668 7.5001 7.4721 9.3406 6.8555 7.8248 7.0151 6.9699 6.8252 8.2709 7.0804 9.7712 6.8752 6.5435 4.7726 5.5701 7.1640 1.2948 2.2528 2.9371 1.7297 5.9090 3.5064 3.9824 7.9594 4.1763 5.9493 3.7431 6.2623 4.2289 6.4636 4.2436 3.3836 3.6572 4.7205 5.6165 4.4045 3.2276 4.6661 1.6786 3.6305 3.0172 1.7426 1.4974 3.0872 1.3254 3.8882 6.5731 5.2313 2.0535 3.6621 4.9432 5.2480 4.5992 4.4652 5.1031 4.2346 1.3662 2.8716 2.7743 1.5094 3.8605 3.6645 3.5052 1.5214 2.5531 2.3221 2.5634 1.1058 1.7985 2.5185 1.2775 1.8018 2.0270 2.0119 2.0005 1.6320 1.4574 1.6361 1.6223 1.5646 1.3587 1.6578 2.4455 1.8619 2.3084 1.9611 2.7825 1.1879 1.1881 1.0857 5.6550 1.0484 1.0804 1.8439 1.0541 5.9620 9.5236 8.7830 9.0097 12.7604 1.0376 1.0361 1.0832 1.0844 1.0860 1.0967 1.0989 1.1004 1.1003 1.0908 1.0927 1.0958 1.1005 1.0775 1.0641 1.0639
irintensity: 0.6913 0.2674 1.5603 0.8242 0.8140 2.4385 1.2962 1.1857 1.2700 1.8819 7.7874 2.0331 1.8673 1.0009 0.3629 6.2120 3.6612 1.1812 0.4924 0.1847 4.9921 0.2533 3.6268 5.2651 1.8875 2.0232 23.8857 1.8241 3.9887 0.8747 1.6966 37.0246 31.1770 5.7529 44.0495 22.4707 21.7477 33.9373 25.1911 84.3606 8.1633 38.3374 149.2875 56.8358 34.5087 12.1208 26.1726 5.5347 27.6577 45.7248 22.0001 10.4803 13.3550 8.6415 22.4268 0.6099 19.2181 5.6517 11.3940 16.5978 3.7062 3.1126 5.6389 9.6168 20.2632 96.9980 368.7331 195.8304 5.6592 91.9476 3.4245 6.9056 5.6352 10.5999 13.7163 10.0946 33.0699 1.2183 10.2488 6.4854 1.6572 9.1638 38.7993 189.7316 42.3647 71.7765 30.0456 1.3087 19.2321 14.0008 5.6119 12.0427 3.7306 39.3397 348.2397 36.5397 4.0738 303.3347 143.7073 214.7087 341.6705 15.6039 19.4369 1.2163 21.1446 0.5995 16.9921 15.0661 7.2991 19.4560 3.4605 3.6561 1.3026 0.0561 57.8942 36.6957 32.0471
temp: 298.150 k
press: 1.00000 atm
elementType: 16 16 8 8 8 8 8 8 7 7 6 6 6 6 6 6 6 6 6 6 6 6 6 6 6 1 1 1 1 1 1 1 1 1 1 1 1 1 1 1 1
symmnumber: 1
zpe: 779177.8 jmol-1
zpe.correction: 0.296773 hartree
zpe.thermalcorrener: 0.321774 hartree
zpe.thermalcorrenthalpy: 0.322719 hartree
zpe.thermalcorrgfe: 0.237940 hartree
zpe.sumelectzpe: -1936.312987 hartree
zpe.sumelectthermal: -1936.287986 hartree
zpe.sumelectthermalent: -1936.287042 hartree
zpe.sumelectthermalfe: -1936.371821 hartree
dipole: 3.0113 5.0088 0.0028
dipole: 5.8443
quadrupole: -132.1170 -166.6441 -171.2195
quadrupole: 3.8317 -3.7887 2.5001
quadrupole: 24.5432 -9.9839 -14.5593 3.8317 -3.7887 2.5001
hfenergy: -1936.6097605 hartree
pointgroup: C01 [X(C15H16N2O6S2)]
dipole: 0.994783 -2.0543955 -0.2770903 debye
polarizability: 233.5135961|-28.9974834|225.2583271|-2.9771549|7.1549314|191.6578903 unknown
InChI: InChI=1S/C15H16N2O6S2/c1-15(2)9(14(22)23)17-11(19)8(12(17)25-15)16-10(18)7(13(20)21)6-3-4-24-5-6/h3-5,7-9,12,16,20,22H,1-2H3
charge 0 multiplicity 1
41 atoms
S  1.256618 -1.155487 1.053761
S  -2.858831 -3.005714 -1.303941
O  1.631205 1.778794 -2.218475
O  5.840053 -0.462367 0.013532
O  4.603578 0.372244 1.798708
O  -1.982589 2.981924 0.300594
O  -5.35982 2.154161 -0.177784
O  -4.440047 1.239469 1.74766
N  2.521359 0.924522 -0.114895
N  -0.791692 1.018217 -0.108696
C  1.539117 0.734009 0.97981
C  2.701203 -1.526562 -0.216283
C  3.487693 -0.144526 -0.357198
C  0.504082 1.591103 0.1536
C  1.576795 1.513994 -1.007438
C  3.55105 -2.675916 0.357168
C  2.079063 -1.906263 -1.57739
C  4.656897 -0.02939 0.619344
C  -1.95442 1.761099 -0.021934
C  -3.25759 1.000097 -0.422677
C  -3.140075 -0.515835 -0.443997
C  -4.375518 1.45724 0.520419
C  -3.086821 -1.349481 0.743941
C  -3.030882 -1.2501 -1.618081
C  -2.941496 -2.69459 0.465047
H  1.84361 1.086054 1.972631
H  3.874328 -0.063094 -1.387054
H  0.359802 2.615607 0.538279
H  2.952825 -3.602196 0.407194
H  4.422392 -2.866751 -0.296379
H  3.910014 -2.449281 1.375159
H  2.871662 -2.222697 -2.28313
H  1.3701 -2.743318 -1.456798
H  1.533116 -1.061113 -2.030651
H  -0.844933 0.014435 -0.315056
H  -3.51187 1.367634 -1.43274
H  6.59294 -0.40516 0.663512
H  -3.169585 -0.943705 1.754678
H  -3.049947 -0.893723 -2.647334
H  -2.875557 -3.535514 1.152521
H  -6.06413 2.460579 0.456774
