program: Gaussian 09
title: 000036789
version: EM64L-G09RevD.01
frameworkgroup: C1[X(C10H12ClNO)]
method: RPBEPBE
basis: SDD
operation: Freq
keyword: #p
keyword: freq=noraman
keyword: PBEPBE/SDD
title: #p freq=noraman PBEPBE/SDD
converged: YES YES NO NO
title: Mulliken charges:
elementType: Cl O N C C C C C C C C C C H H H H H H H H H H H H
charge: -0.076756 -0.275473 -0.306575 -0.071041 -0.543805 0.257441 -0.402254 0.183364 -0.377716 -0.347353 -0.104091 -0.188563 -0.620466 0.232517 0.239604 0.270228 0.223562 0.222594 0.266204 0.257047 0.253871 0.254603 0.224816 0.198503 0.229741
chargesum: 0.00000
title: Mulliken charges with hydrogens summed into heavy atoms:
elementType: Cl O N C C C C C C C C C C
charge: -0.076756 -0.275473 -0.049528 0.161476 -0.033974 0.257441 0.043902 0.183364 -0.111512 -0.093482 -0.104091 0.066040 0.032594
polarizability: 1.76443779e+02 7.59030108e+00 1.14021328e+02 1.38439057e+01 -1.22636069e+01 8.34775587e+01
1716.lowfreq: -7.8964 -5.0358 -2.9952 0.0010 0.0013 0.0020 28.6531 78.9021 92.9393
frequency: 28.0035 78.8913 92.9367 103.9409 156.6771 198.0336 212.5891 239.9464 285.2094 323.4924 346.4504 384.1851 418.0236 426.0324 459.1781 537.3832 581.0925 648.3561 673.9679 700.7248 706.7786 776.8605 808.8160 849.2503 863.3140 872.7434 902.2486 925.7681 933.4463 965.7523 1037.5694 1055.6780 1071.7429 1093.4384 1103.5308 1118.7196 1152.5152 1162.9993 1197.0411 1216.5118 1232.2411 1243.8086 1273.6001 1289.0034 1327.6063 1363.5584 1380.1889 1416.6493 1437.0242 1451.2132 1457.2096 1468.6213 1471.4051 1484.3244 1495.2222 1595.7315 1613.1001 2889.4439 2903.6542 2998.4227 3014.7399 3021.6784 3048.3779 3067.2102 3080.2539 3161.0638 3163.5057 3181.0796 3443.0592
redmass: 4.4217 3.0866 2.2795 3.3398 4.3669 2.4293 4.5601 1.5570 5.0084 4.2973 3.8722 6.7016 2.9192 3.7288 2.5076 3.6317 6.2429 7.7374 1.3964 4.0755 4.2357 6.0454 1.4026 3.5721 2.8632 1.5021 2.4225 2.0398 1.4400 2.1627 1.6439 2.0068 1.8504 2.3245 1.2596 1.4604 1.6034 3.3797 1.6773 1.4784 2.9474 1.2808 1.4027 1.4131 1.3815 1.5241 5.7057 3.8104 1.1436 1.3421 1.9980 1.1540 1.1374 1.0740 1.0520 7.9121 8.2864 1.0552 1.0679 1.0642 1.0895 1.0776 1.0893 1.0996 1.1001 1.0889 1.0933 1.0974 1.0742
irintensity: 0.1694 1.2635 1.6398 1.8957 0.6030 3.6609 2.6386 2.8399 0.9572 1.2919 6.4894 7.9898 3.2505 18.8526 1.1900 3.2280 5.8240 39.2475 93.0795 4.5585 16.2746 2.9062 51.4942 0.4648 37.5518 17.2739 19.0285 20.2856 4.6590 1.4857 32.8486 12.7210 2.9956 66.6340 21.1868 18.0964 37.8329 34.2524 11.2711 1.6224 79.5802 17.4320 13.4057 2.9093 14.6732 2.6804 4.0133 30.0191 4.9414 49.3862 78.9077 17.8329 40.9221 11.5083 11.5491 1.7794 1.9162 121.6256 99.6575 17.0238 11.2973 36.7544 55.6938 15.5848 39.0689 2.2152 1.8674 3.9816 0.6443
temp: 298.150 k
press: 1.00000 atm
elementType: 17 8 7 6 6 6 6 6 6 6 6 6 6 1 1 1 1 1 1 1 1 1 1 1 1
symmnumber: 1
zpe: 524459.8 jmol-1
zpe.correction: 0.199756 hartree
zpe.thermalcorrener: 0.212071 hartree
zpe.thermalcorrenthalpy: 0.213016 hartree
zpe.thermalcorrgfe: 0.160006 hartree
zpe.sumelectzpe: -977.309940 hartree
zpe.sumelectthermal: -977.297625 hartree
zpe.sumelectthermalent: -977.296681 hartree
zpe.sumelectthermalfe: -977.349690 hartree
dipole: 3.9941 -0.0798 0.2937
dipole: 4.0057
quadrupole: -79.2793 -85.0721 -82.1578
quadrupole: -4.8265 1.8141 -1.9187
quadrupole: 2.8904 -2.9024 0.0120 -4.8265 1.8141 -1.9187
hfenergy: -977.5096961 hartree
pointgroup: C01 [X(C10H12Cl1N1O1)]
dipole: 1.5477128 -0.0298099 -0.2955834 debye
dipolederiv: -0.6209759 0.2387938 0.2334896 0.295032 -0.2832076 -0.1327066 0.2621332 -0.1230527 -0.1939926 -1.4793142 0.1115784 0.2678412 0.1535214 -0.3923919 -0.1164737 0.4168446 -0.1038124 -0.4380434 -0.6776219 -0.0266646 -0.238471 -0.0767138 -0.5511152 0.092248 -0.3555437 0.0904749 -0.321385 0.7950361 0.0263598 -0.068491 0.3322823 0.2200008 -0.0454019 -0.0560143 0.017785 0.3871878 -0.1557572 0.0866973 0.0662829 -0.0587362 -0.0724317 -0.009284 0.0782684 -0.0248747 0.098016 0.0199514 0.011941 -0.0586042 0.4510641 -0.0395258 -0.1429903 -0.0906502 -0.0174778 -0.0582281 0.396805 0.1170029 -0.0324454 -0.0011213 0.4183505 0.0468818 -0.0823563 -0.0261947 0.0291781 1.0339397 -0.2553213 -0.3148476 -0.7005318 0.085209 0.2023598 -0.474695 0.105649 0.2158076 -0.092068 0.1008229 0.0071883 0.0342842 0.0136876 -0.0171192 0.0058323 -0.0357663 -0.1106696 -0.2126067 0.1393873 0.0011601 -0.0274475 0.0722302 0.0297836 0.0066381 -0.0399579 -0.1663832 0.6817459 -0.3803337 -0.3592415 -0.5151581 0.2284176 0.2356903 -0.3771491 0.2002271 0.0894694 -0.1656507 0.0119613 0.0123766 0.1413618 0.013141 -0.052302 0.0340514 0.0000029 -0.1243893 0.3321234 -0.0832947 0.1588765 -0.0377329 0.2835447 0.0032239 0.3656334 -0.0053349 0.3672495 -0.0692128 0.0153326 0.095895 0.0003578 0.0583081 -0.014147 0.1050593 -0.0167699 -0.1113524 0.0077728 0.0068475 -0.0094988 0.0336594 0.0317599 0.0891864 0.0228377 0.1200377 -0.08906 0.1020229 -0.0792282 -0.0000518 -0.0778996 0.0308031 -0.0468687 -0.0352059 -0.0731401 0.0397246 -0.0607877 0.0693417 -0.0265692 0.0023305 -0.2468243 0.0019918 -0.008843 -0.0005048 0.0591258 0.0374693 -0.0130998 0.0706889 -0.0024231 0.0367406 -0.0521222 0.1075375 -0.0108597 -0.0903029 0.1088727 -0.0097935 0.0223986 0.0054348 -0.0354832 -0.0122253 0.0186328 -0.0098708 0.1499484 0.1023735 -0.0608404 0.0670553 -0.018136 0.2326045 -0.1557991 0.0650537 -0.0565093 0.0211679 0.0958584 0.0182275 0.0363947 -0.0002324 -0.0572622 -0.0176824 0.0309825 -0.0204305 0.1583173 0.0018416 -0.0663468 0.0645382 -0.0550207 0.0697691 0.0177069 0.0705398 0.0219111 0.1391223 -0.1003213 -0.125215 -0.0216144 -0.1625521 -0.0252335 0.0305765 0.0217666 0.0487384 0.0744114 -0.0989324 0.0853686 -0.1043158 0.2294378 -0.1627056 0.1114057 -0.1635669 0.0225263 -0.0250896 0.0174362 0.0604755 0.129965 0.0549396 0.0716141 -0.0459324 0.032213 -0.0627957 -0.0998297 unknown
polarizability: 170.3960542|-4.1027241|118.2530461|-27.4147657|5.9457617|85.2935654 unknown
InChI: InChI=1S/C10H12ClNO/c1-12-6-9-5-7-4-8(11)2-3-10(7)13-9/h2-4,9,12H,5-6H2,1H3
charge 0 multiplicity 1
25 atoms
Cl -4.106471 1.336033 1.341216
O  0.675112 -1.443243 -0.975206
N  3.792678 0.513855 -0.138144
C  1.66678 -0.304372 -1.0943
C  0.84399 1.00958 -0.944012
C  -0.460411 0.516237 -0.335772
C  2.723141 -0.491932 0.012386
C  -0.492853 -0.897129 -0.414099
C  -1.557063 1.214417 0.19719
C  -1.597023 -1.653266 0.014455
C  -2.665796 0.454717 0.636521
C  -2.705902 -0.951642 0.551385
C  4.71784 0.614485 1.008593
H  2.126406 -0.413964 -2.092394
H  0.663247 1.491285 -1.923221
H  1.401025 1.7256 -0.315739
H  3.082589 -1.548034 -0.013754
H  2.238298 -0.339135 0.996445
H  -1.564187 2.305777 0.269645
H  4.297378 0.3990 -1.027534
H  -1.60126 -2.743795 -0.060581
H  -3.58624 -1.498241 0.901484
H  5.487728 1.377104 0.796471
H  5.235504 -0.340247 1.267755
H  4.159195 0.94431 1.903611
