program: Gaussian 09
title: 000000736
version: EM64L-G09RevD.01
frameworkgroup: C1[X(C6H10O6)]
method: RPBEPBE
basis: SDD
operation: Freq
keyword: #pfreq=noraman
keyword: PBEPBE/SDD
title: #p freq=noraman PBEPBE/SDD
converged: YES YES NO NO
title: Mulliken charges:
elementType: O O O O O O C C C C C C H H H H H H H H H H
charge: -0.200201 -0.452533 -0.454417 -0.478900 -0.447438 -0.237826 -0.147879 -0.116879 0.022530 -0.230517 -0.381819 0.199549 0.249032 0.234016 0.247565 0.261051 0.245254 0.209390 0.366802 0.377645 0.381874 0.353702
chargesum: 0.00000
title: Mulliken charges with hydrogens summed into heavy atoms:
elementType: O O O O O O C C C C C C
charge: -0.200201 -0.085732 -0.076772 -0.097026 -0.093735 -0.237826 0.101153 0.117137 0.270095 0.030534 0.072824 0.199549
polarizability: 1.02028885e+02 5.29596954e+00 8.38335545e+01 1.92929602e+00 2.01688468e+00 6.22770917e+01
1716.lowfreq: -9.0122 -5.3712 -0.0004 0.0006 0.0008 8.3232 43.4845 78.1154 95.5727
frequency: 43.3898 78.1084 95.5586 122.9591 168.8247 216.3614 248.2721 254.2617 296.6485 310.1959 324.2570 365.0366 379.4394 399.0225 442.7402 468.5347 520.6013 539.2847 573.1648 593.4910 616.7486 734.0808 800.2739 874.0579 957.2234 974.6070 992.4196 998.9379 1020.4941 1044.3646 1060.5159 1068.2821 1100.8623 1146.0241 1189.8438 1210.9662 1218.6235 1237.7675 1250.9644 1265.1119 1281.9918 1303.0719 1323.2073 1327.1565 1363.6414 1388.9719 1405.5934 1423.1893 1466.4619 1648.1635 2965.0306 2973.5944 2981.0908 2988.9390 3025.4337 3041.1587 3418.0097 3440.5018 3572.9018 3588.3383
redmass: 6.8290 6.8879 4.1829 9.1009 1.2525 2.5235 4.2646 5.8311 4.6796 6.0291 3.7390 1.4350 2.7037 5.3487 2.4816 1.6087 5.6534 2.5085 2.2444 3.0412 3.3315 4.0538 5.2963 4.5458 4.3732 6.1621 3.6539 3.5639 2.3557 5.1351 3.8245 3.1222 1.7470 2.8051 1.2805 1.1019 1.2498 1.2925 1.1985 1.2421 1.2624 1.2092 1.3105 1.2710 1.3886 1.5877 1.4806 1.5844 1.0819 11.2282 1.0823 1.0575 1.0829 1.0857 1.0870 1.1035 1.0647 1.0641 1.0663 1.0668
irintensity: 3.0890 1.4912 0.6451 1.1802 146.1340 36.0011 20.5735 10.8412 28.0623 11.0798 7.5528 135.2001 46.6215 10.4068 18.4163 85.2018 11.5102 80.3657 71.0836 31.7858 36.8638 40.0347 1.7337 20.9250 57.6552 19.9923 26.8176 161.4166 22.0204 169.2992 19.4375 70.7113 20.3510 182.8669 23.7192 0.3969 9.4386 21.8562 74.4765 22.5987 11.7136 14.1940 54.4985 4.2024 8.6699 33.8096 11.0295 1.4789 9.9719 275.8636 12.6603 29.6067 5.5621 59.5858 13.0926 31.5553 67.7101 43.0850 18.4215 8.0792
temp: 298.150 k
press: 1.00000 atm
elementType: 8 8 8 8 8 8 6 6 6 6 6 6 1 1 1 1 1 1 1 1 1 1
symmnumber: 1
zpe: 437407.2 jmol-1
zpe.correction: 0.166600 hartree
zpe.thermalcorrener: 0.178968 hartree
zpe.thermalcorrenthalpy: 0.179912 hartree
zpe.thermalcorrgfe: 0.128112 hartree
zpe.sumelectzpe: -684.983469 hartree
zpe.sumelectthermal: -684.971101 hartree
zpe.sumelectthermalent: -684.970156 hartree
zpe.sumelectthermalfe: -685.021957 hartree
dipole: 1.7506 2.3480 0.2518
dipole: 2.9396
quadrupole: -62.9693 -77.9556 -71.3545
quadrupole: -0.7436 -5.9912 -2.4473
quadrupole: 7.7905 -7.1958 -0.5947 -0.7436 -5.9912 -2.4473
hfenergy: -685.1500687 hartree
pointgroup: C01 [X(C6H10O6)]
dipole: 0.7039064 0.9153958 0.0640244 debye
dipolederiv: -1.3953565 -0.4512351 -0.0419516 -0.2140842 -0.5033846 -0.0210276 0.0929171 0.0099345 -0.2755965 -0.4493225 -0.2292237 0.1747545 -0.2948292 -0.754195 -0.0626003 0.1498299 -0.0858856 -0.4314615 -0.5934474 0.1574858 -0.1541007 0.1734737 -0.6350137 0.0188501 -0.2155015 0.0275921 -0.4996379 -0.8018033 -0.1318189 0.0140095 -0.0620146 -0.4214719 0.1063152 0.0933694 0.1028229 -0.4671261 -0.5153305 0.1291171 -0.2713302 0.1785121 -0.6454618 0.0254625 -0.3413846 0.048926 -0.4354896 -0.8858793 -0.2524283 -0.029571 -0.369261 -0.8156436 -0.1655659 -0.148896 -0.2923209 -0.4167424 0.2269185 0.1948446 -0.0940373 0.1674666 0.5913462 0.0254414 -0.0506052 0.0161749 0.2842222 0.3278922 -0.1340037 0.1927199 -0.1297449 0.3493445 0.028412 0.2400138 0.033111 0.3491937 0.4638727 0.235135 0.0322555 0.308288 0.4084954 0.0243674 0.1559333 0.0104026 0.2882782 0.4612 0.0708401 0.060515 0.2093575 -0.0782804 -0.1474418 0.0591868 -0.1936534 0.2094058 0.394582 -0.2069111 0.1911257 -0.187798 0.4015594 -0.0868287 0.2307546 -0.0525248 0.3431022 1.6344344 0.4930384 0.0393085 0.3286822 0.9208924 0.3160737 -0.0207103 0.4132437 0.3863963 0.019275 -0.0342466 -0.0209401 -0.0228077 -0.0218976 -0.0421771 -0.0188694 -0.0554972 -0.1114393 0.0075638 -0.0025266 -0.0368597 0.0053034 -0.0616471 -0.0818224 -0.0435536 -0.0637051 -0.1391094 0.0626345 -0.012115 0.0436986 -0.0830392 0.0135081 -0.0003231 -0.0011042 -0.0215087 -0.0879952 -0.0141023 0.0334079 -0.0651543 0.0192238 0.0351 0.0201291 -0.0909554 0.0321054 -0.0665705 0.0220379 -0.075836 -0.0194898 -0.0358821 -0.0898002 0.0525236 -0.0518541 0.0201775 0.0534589 0.0436421 0.0311249 -0.0456192 0.0715855 0.0277486 -0.0518998 -0.042611 -0.0119584 -0.1620665 0.2117254 0.1363207 -0.1162734 0.0923316 0.2459368 0.0446647 -0.1200332 0.0569684 0.3108696 0.2394759 -0.042733 0.0355678 -0.0851284 0.4465605 -0.0114242 0.0619009 -0.0015555 0.2902873 0.4410813 0.0401578 -0.0126674 -0.0919491 0.2311072 -0.0342272 -0.0988013 -0.0265916 0.3271117 0.098906 0.0516057 0.1240397 0.0223139 0.355197 0.0430986 0.160974 0.0337424 0.250909 unknown
polarizability: 102.127005|5.0498917|83.8020633|2.5008917|0.9231973|62.2104627 unknown
InChI: InChI=1S/C6H10O6/c7-1-2-3(8)4(9)5(10)6(11)12-2/h2-5,7-10H,1H2
charge 0 multiplicity 1
22 atoms
O  0.567221 -1.223045 -0.261996
O  1.213015 2.43751 -0.078066
O  -1.860895 1.817022 -0.740043
O  -2.888318 -0.216692 0.604997
O  3.381859 -0.940001 0.697503
O  -1.488247 -2.209574 -0.589465
C  0.450322 1.220119 -0.351859
C  -0.964376 1.272039 0.265934
C  1.252464 0.034281 0.225762
C  -1.441548 -0.151204 0.719683
C  2.695148 -0.044293 -0.241837
C  -0.804617 -1.280043 -0.106235
H  0.320964 1.06639 -1.444532
H  -0.935765 1.928288 1.161183
H  1.241104 0.036596 1.333041
H  -1.13537 -0.303246 1.774896
H  3.121413 0.977371 -0.213545
H  2.722837 -0.432191 -1.280673
H  0.713199 3.207214 -0.450759
H  -2.769688 1.460597 -0.527821
H  -3.10864 -1.090366 0.170559
H  4.290918 -1.140274 0.363472
