program: Gaussian 09
title: 000036826
version: EM64L-G09RevD.01
frameworkgroup: C1[X(C12H18N2O2S2)]
method: RPBEPBE
basis: SDD
operation: Freq
keyword: #p
keyword: freq=noraman
keyword: PBEPBE/SDD
title: #p freq=noraman PBEPBE/SDD
converged: YES YES NO NO
title: Mulliken charges:
elementType: S S O O N N C C C C C C C C C C C C H H H H H H H H H H H H H H H H H H
charge: 0.311761 0.310614 -0.196208 -0.196430 -0.100922 -0.204184 -0.374664 -0.361232 -0.330186 -0.329212 0.226507 0.205359 -0.267474 -0.262295 -0.625198 -0.623301 -0.672358 -0.671787 0.215318 0.237831 0.252788 0.236804 0.204039 0.190168 0.216331 0.191773 0.266396 0.294353 0.266572 0.293491 0.223016 0.225666 0.204735 0.207392 0.226631 0.207907
chargesum: 0.00000
title: Mulliken charges with hydrogens summed into heavy atoms:
elementType: S S O O N N C C C C C C C C C C C C
charge: 0.311761 0.310614 -0.196208 -0.196430 -0.100922 -0.204184 0.078485 0.128359 0.064020 0.078892 0.226507 0.205359 -0.267474 -0.262295 -0.064449 -0.063238 -0.018940 -0.029857
polarizability: 2.44796872e+02 7.46638065e-01 2.06104158e+02 1.19764115e+01 -1.86865279e+00 1.13306269e+02
1716.lowfreq: -0.0011 0.0012 0.0022 2.1395 4.4564 11.5783 19.9199 24.4603 32.9925
frequency: 19.6320 24.0711 32.9533 58.7953 62.6402 72.3726 87.8991 97.1231 132.4775 157.2790 187.1422 197.1931 217.2004 229.1964 242.3047 253.3570 267.8140 283.5260 300.2793 319.3150 358.1253 360.1055 394.8095 437.0770 440.2111 460.5692 466.4276 522.8610 591.2424 610.6451 621.7687 710.0958 720.7272 735.0437 748.8941 782.4803 794.6138 799.5993 835.3073 858.5064 899.2411 914.0056 916.5905 987.5347 994.2752 1020.2894 1042.6174 1075.7217 1078.9486 1083.9436 1085.8517 1126.8494 1130.0882 1132.5407 1164.2945 1195.1880 1209.5486 1212.9371 1271.1562 1285.6569 1289.5527 1291.6968 1297.8653 1314.2344 1330.0641 1354.0736 1363.0744 1369.9156 1385.8145 1387.8291 1389.9796 1432.6209 1433.1507 1450.0573 1462.3871 1464.9471 1472.1298 1480.0761 1487.3933 1489.2599 1492.0471 1563.3163 1614.6743 1668.8765 2855.5892 2863.5237 2898.3545 2982.3004 2982.7613 3023.5810 3031.1998 3033.6928 3034.8520 3041.5764 3053.4867 3074.5685 3076.0258 3090.9706 3091.4002 3099.7518 3109.0624 3120.6090
redmass: 4.5397 4.3308 4.2070 3.1601 3.2553 3.4190 2.1069 12.3954 6.4124 1.6561 5.8441 3.3694 1.6092 2.8017 1.9543 2.5263 4.1011 2.0523 3.0135 3.4836 8.9693 10.2518 3.0459 3.2264 3.5793 9.8445 2.9504 5.2162 5.4932 9.2370 4.3065 3.6500 9.6137 11.6254 2.8315 1.4246 1.1594 1.2316 3.8392 6.0962 2.4587 1.9133 1.6714 2.3354 2.5932 3.3096 3.6406 2.3596 2.0674 1.8690 2.2662 8.8062 1.1993 1.7090 4.3898 1.1566 2.3951 2.4414 1.2762 1.2344 1.2327 1.2553 1.1934 1.2374 1.4788 3.6917 1.3471 1.3437 1.3205 1.2615 1.2432 1.0820 1.0829 1.1027 1.0516 1.0543 1.0560 1.0550 1.0702 1.0718 1.0760 11.7007 12.5337 11.7750 1.0720 1.0714 1.0708 1.0358 1.0358 1.0877 1.0591 1.0875 1.0572 1.0595 1.0892 1.0988 1.0981 1.1004 1.1004 1.1060 1.1071 1.1067
irintensity: 0.1718 0.3410 2.0929 1.9518 1.1180 0.0773 0.1931 0.0111 5.4766 0.5029 0.6937 1.7185 0.4222 2.5285 3.5525 1.2500 0.1467 2.2573 3.1952 8.4656 0.5494 0.5923 6.2629 1.5956 0.2239 2.4219 14.4670 23.1169 1.1681 20.9747 1.7488 1.1160 28.3627 0.5308 3.6891 5.3676 4.3265 4.8953 30.1255 3.9386 4.8464 2.7082 5.2893 8.1381 9.7497 2.5338 2.5588 18.4857 43.6880 46.9461 11.0111 25.0395 18.7306 7.4397 62.1053 4.1292 18.9963 25.2359 13.5858 42.3307 4.8093 22.0017 23.2088 11.8069 49.9298 343.2943 0.4959 18.8146 38.8633 11.9253 20.6096 12.4494 11.0246 32.1016 5.9561 1.0501 1.0146 3.5582 11.1307 14.9990 12.6177 138.8451 460.5775 27.1031 33.0368 156.4422 90.7490 34.2149 27.7781 14.2125 21.4195 21.8455 6.2624 26.8219 10.5658 25.1993 88.3377 28.4289 55.1071 5.2173 0.8197 7.0703
temp: 298.150 k
press: 1.00000 atm
elementType: 16 16 8 8 7 7 6 6 6 6 6 6 6 6 6 6 6 6 1 1 1 1 1 1 1 1 1 1 1 1 1 1 1 1 1 1
symmnumber: 1
zpe: 754049.9 jmol-1
zpe.correction: 0.287202 hartree
zpe.thermalcorrener: 0.307070 hartree
zpe.thermalcorrenthalpy: 0.308015 hartree
zpe.thermalcorrgfe: 0.236109 hartree
zpe.sumelectzpe: -1522.752589 hartree
zpe.sumelectthermal: -1522.732721 hartree
zpe.sumelectthermalent: -1522.731777 hartree
zpe.sumelectthermalfe: -1522.803683 hartree
dipole: 3.1448 0.0550 1.5722
dipole: 3.5163
quadrupole: -85.7305 -140.3754 -122.0482
quadrupole: 2.0854 0.1048 1.2084
quadrupole: 30.3208 -24.3240 -5.9968 2.0854 0.1048 1.2084
hfenergy: -1523.0397918 hartree
pointgroup: C01[X(C12H18N2O2S2)]
dipole: 1.235099 -0.2060955 0.5881442 debye
polarizability: 244.7190247|-4.0170562|197.0349781|11.7745658|27.5967647|122.4532956 unknown
InChI: InChI=1S/C12H18N2O2S2/c1-3-13(4-2)5-6-14-11(15)9-10(12(14)16)18-8-7-17-9/h3-8H2,1-2H3
charge 0 multiplicity 1
36 atoms
S  3.675426 1.707457 0.693394
S  3.724273 -1.864494 -0.312877
O  0.503757 2.284936 0.307281
O  0.58863 -2.207752 -1.067171
N  -3.5614 -0.019973 0.263092
N  0.167414 0.054759 -0.454983
C  -2.118065 -0.00618 0.584539
C  -1.28002 0.109377 -0.713719
C  -4.397224 0.767804 1.206374
C  -4.083528 -1.386556 -0.007602
C  0.940156 1.138359 0.038704
C  0.983122 -1.092146 -0.647773
C  2.351123 0.627325 0.150675
C  2.375742 -0.684593 -0.249202
C  5.139831 0.606133 0.187462
C  5.015809 -0.853115 0.648135
C  -4.234986 2.288428 1.019079
C  -5.297423 -1.392612 -0.956271
H  -1.800208 -0.916696 1.146169
H  -1.889347 0.865002 1.223022
H  -1.521658 1.063463 -1.21211
H  -1.518395 -0.720677 -1.400996
H  -5.453544 0.500863 1.020606
H  -4.184433 0.491993 2.270378
H  -3.269422 -1.972606 -0.474205
H  -4.344017 -1.916794 0.943388
H  6.004248 1.086493 0.676792
H  5.256795 0.676608 -0.905047
H  5.958867 -1.392981 0.456496
H  4.772259 -0.919205 1.719759
H  -3.19279 2.616018 1.186301
H  -4.519183 2.57665 -0.007983
H  -4.877332 2.837141 1.733186
H  -6.154767 -0.838257 -0.533411
H  -5.030022 -0.921529 -1.918072
H  -5.631491 -2.42944 -1.148311
