program: Gaussian 09
title: 000036834
version: EM64L-G09RevD.01
frameworkgroup: C1[X(C17H13ClF4N2)]
method: RPBEPBE
basis: SDD
operation: Freq
keyword: #p
keyword: freq=noraman
keyword: PBEPBE/SDD
title: #p freq=noraman PBEPBE/SDD
converged: YES YES NO NO
title: Mulliken charges:
elementType: Cl F F F F N N C C C C C C C C C C C C C C C C C H H H H H H H H H H H H H
charge: -0.053956 -0.166696 -0.160190 -0.157874 -0.180738 -0.250844 0.018142 -0.377611 0.346633 0.210213 -0.489703 -0.529598 -0.018866 -0.361790 -0.318788 0.178220 0.437598 -0.238583 -0.135077 0.171673 -0.319978 -0.372341 -0.240730 -0.200699 0.214292 0.253478 0.261995 0.253244 0.246709 0.225396 0.230095 0.281810 0.257667 0.261132 0.255295 0.234622 0.235846
chargesum: 0.00000
title: Mulliken charges with hydrogens summed into heavy atoms:
elementType: Cl F F F F N N C C C C C C C C C C C C C C C C C
charge: -0.053956 -0.166696 -0.160190 -0.157874 -0.180738 -0.250844 0.018142 0.090159 0.346633 0.210213 0.025536 -0.057492 -0.018866 -0.131695 -0.036978 0.178220 0.437598 0.019085 -0.135077 0.171673 -0.058846 -0.117046 -0.006108 0.035147
polarizability: 2.38942971e+02 8.85376148e+00 2.13694706e+02 2.70870064e+01 -1.92974460e+01 1.77024718e+02
1716.lowfreq: -6.7307 -5.2622 -0.0019 -0.0017 -0.0017 8.6854 21.4841 27.5164 31.0723
frequency: 21.3083 27.4062 31.0275 42.0946 54.0633 70.0754 87.9476 116.2021 137.0681 146.6541 169.5034 205.3046 216.7715 230.1979 250.9636 285.2956 299.2751 314.5980 329.8340 348.0451 390.9387 406.4954 409.1227 423.3242 445.6481 457.4666 463.2682 489.5095 496.3021 521.9760 537.0272 559.5807 577.1328 583.7352 637.7564 645.0060 677.3344 695.9870 740.1761 744.8295 754.8300 767.9831 775.5923 803.9824 816.5503 852.6277 865.4715 875.0596 896.1121 916.1373 942.5922 946.5216 954.8610 986.0614 1013.4401 1018.0135 1036.6254 1051.4688 1072.0482 1079.2387 1096.2178 1111.6155 1132.0377 1164.7626 1172.3731 1177.5955 1193.4569 1195.3133 1208.6308 1251.1591 1263.8822 1265.3325 1275.6987 1294.2538 1325.9929 1342.5412 1362.2066 1372.5321 1376.0080 1379.3348 1409.3196 1431.6401 1441.6200 1464.9796 1476.6405 1479.9692 1494.9978 1554.8673 1578.0643 1590.3196 1596.0448 1615.4926 2919.6803 2953.5817 3009.8617 3032.5063 3063.6032 3090.2028 3137.6288 3138.7478 3148.3721 3161.7057 3165.0377 3171.1175 3179.0413
redmass: 8.9615 8.8490 9.8273 13.5508 7.5658 5.4608 6.4650 4.5269 4.2968 7.2427 4.6345 7.3367 7.3491 9.0075 5.6758 8.7520 5.3445 4.8173 4.6589 4.1547 4.3523 3.8450 5.5165 4.8369 4.8203 6.2184 7.0986 4.8982 3.7545 4.4728 5.5841 5.7457 4.9430 3.8696 5.9731 4.4950 5.9273 5.1985 4.3331 6.3759 4.1002 1.4576 4.1095 5.6771 1.5686 2.4768 1.5525 2.5195 1.4811 2.9117 1.4962 2.0140 1.9974 1.3295 8.2439 2.8549 2.1533 2.8334 2.7785 2.7553 2.3183 2.0784 2.0074 1.6574 1.2469 4.8823 2.7231 3.5187 1.3033 1.4984 1.5322 1.4741 1.4880 2.6053 1.4472 1.3155 8.2296 1.6546 3.3340 2.8350 1.9918 2.3365 1.1202 1.7629 1.0960 2.6622 1.4260 7.5842 6.9263 8.0238 7.3848 7.2692 1.0690 1.0683 1.0642 1.0912 1.0944 1.0985 1.0862 1.0884 1.0908 1.0922 1.0953 1.0962 1.0995
irintensity: 0.3528 1.7741 0.3192 0.0505 1.4996 1.2431 0.1739 5.8374 2.4398 0.8791 2.2156 1.2994 0.1336 0.3048 2.9206 1.3907 4.4182 2.0825 0.7762 5.9482 2.0425 0.4970 4.7487 1.2894 4.4244 0.5194 9.9811 1.9320 8.3928 20.5808 0.1562 6.2857 25.1339 9.5321 13.3920 1.7123 0.3560 4.6676 7.0857 13.1310 8.6559 114.4813 16.7074 30.5900 25.4366 4.3727 1.2099 6.1942 16.8330 78.4792 4.8355 10.8234 9.6778 0.1770 255.6989 9.3887 7.0887 36.0572 54.0932 15.5357 52.2266 23.8077 1.8186 4.0922 18.0128 129.8977 47.8102 37.6818 3.0523 41.5975 7.6186 44.2726 24.6697 45.5035 56.2625 11.6947 5.1853 7.8103 2.5415 20.4094 6.0735 22.4347 14.0190 96.2085 7.1987 36.8000 107.1861 20.6549 19.2451 49.6543 49.0916 20.8456 106.1052 49.7460 33.3352 17.8119 41.3518 3.0723 0.5432 13.9553 9.6634 0.4545 13.5896 4.8137 11.0587
temp: 298.150 k
press: 1.00000 atm
elementType: 17 9 9 9 9 7 7 6 6 6 6 6 6 6 6 6 6 6 6 6 6 6 6 6 1 1 1 1 1 1 1 1 1 1 1 1 1
symmnumber: 1
zpe: 693699.2 jmol-1
zpe.correction: 0.264216 hartree
zpe.thermalcorrener: 0.285166 hartree
zpe.thermalcorrenthalpy: 0.286110 hartree
zpe.thermalcorrgfe: 0.211980 hartree
zpe.sumelectzpe: -1622.805984 hartree
zpe.sumelectthermal: -1622.785035 hartree
zpe.sumelectthermalent: -1622.784090 hartree
zpe.sumelectthermalfe: -1622.858220 hartree
dipole: 2.6244 1.5312 0.5143
dipole: 3.0816
quadrupole: -131.5095 -152.3769 -141.9494
quadrupole: 13.5007 17.9085 3.1928
quadrupole: 10.4358 -10.4316 -0.0041 13.5007 17.9085 3.1928
hfenergy: -1623.0702003 hartree
pointgroup: C01 [X(C17H13Cl1F4N2)]
dipole: -1.1630481 -0.2632057 0.2190009 debye
polarizability: 241.2885416|0.0607158|211.6666056|-20.7929744|26.0079589|176.7072479 unknown
InChI: InChI=1S/C17H13ClF4N2/c18-11-5-6-15-13(9-11)16(12-3-1-2-4-14(12)19)23-7-8-24(15)10-17(20,21)22/h1-6,9H,7-8,10H2
charge 0 multiplicity 1
37 atoms
Cl 0.355457 -4.908018 -0.491241
F  -4.023138 2.23616 -1.736185
F  -2.229546 3.046946 -0.598757
F  -1.994686 1.223509 -1.925742
F  3.643416 0.626241 1.788784
N  -2.087323 0.482239 0.926734
N  0.757611 1.036127 1.856658
C  -1.698133 1.346509 2.076554
C  -1.486738 -0.778234 0.645567
C  -0.059691 -0.944941 0.581103
C  -3.244943 0.934077 0.170809
C  -0.408412 0.86367 2.755419
C  0.890643 0.182769 0.868092
C  -2.309108 -1.90575 0.357401
C  0.481484 -2.21179 0.234975
C  2.060931 0.350194 -0.051182
C  -2.866033 1.852144 -1.007813
C  -1.765682 -3.155225 0.006725
C  -0.364898 -3.293487 -0.046089
C  3.372487 0.619156 0.409936
C  1.87628 0.290244 -1.459807
C  4.457799 0.83849 -0.455295
C  2.945344 0.514317 -2.352014
C  4.238332 0.792507 -1.84964
H  -2.52295 1.355161 2.825251
H  -1.54642 2.383616 1.724256
H  -3.81364 0.098844 -0.268698
H  -3.939507 1.509797 0.811594
H  -0.241244 1.482817 3.653318
H  -0.53478 -0.191396 3.082049
H  -3.3982 -1.817355 0.432692
H  1.567323 -2.331146 0.176115
H  -2.418702 -4.007226 -0.203145
H  0.872225 0.086376 -1.847251
H  5.448175 1.033541 -0.033659
H  2.77045 0.477013 -3.43189
H  5.073817 0.967106 -2.535522
