program: Gaussian 09
title: 000036795
version: EM64L-G09RevD.01
frameworkgroup: C1[X(C11H15NO2)]
method: RPBEPBE
basis: SDD
operation: Freq
keyword: #p
keyword: freq=noraman
keyword: PBEPBE/SDD
title: #p freq=noraman PBEPBE/SDD
converged: YES YES NO NO
title: Mulliken charges:
elementType: O O N C C C C C C C C C C C H H H H H H H H H H H H H H H
charge: -0.260725 -0.250177 -0.305099 -0.071973 -0.544163 0.260305 -0.404871 0.072922 -0.425928 0.219776 -0.236766 -0.353410 -0.620986 -0.535746 0.228855 0.234057 0.264494 0.224179 0.223256 0.239059 0.255095 0.219365 0.239196 0.222566 0.196755 0.228483 0.219167 0.217860 0.244453
chargesum: 0.00000
title: Mulliken charges with hydrogens summed into heavy atoms:
elementType: O O N C C C C C C C C C C C
charge: -0.260725 -0.250177 -0.050004 0.156881 -0.045611 0.260305 0.042564 0.072922 -0.186869 0.219776 -0.017402 -0.114214 0.026819 0.145734
polarizability: 1.69652809e+02 4.54352361e+00 1.37509344e+02 -1.51386788e+01 5.22850039e+00 8.90038248e+01
1716.lowfreq: -8.9687 -0.0006 -0.0003 0.0003 5.4263 9.2281 33.4662 54.1233 89.4764
frequency: 33.3872 54.1202 89.4738 97.2288 115.4026 177.2781 187.5756 200.1765 231.7821 244.1988 285.0414 311.1618 319.8122 394.4678 444.4522 472.0538 496.8832 525.2960 547.2847 598.1058 647.5240 677.8046 714.9440 734.7867 757.9842 808.5313 856.0066 862.0826 897.8801 903.9485 932.7812 940.8409 966.2074 1036.4085 1050.8200 1062.9077 1073.1060 1101.9468 1110.6709 1117.8004 1147.2499 1153.4544 1163.0205 1187.4636 1197.0838 1217.6288 1240.3049 1260.3760 1281.0077 1286.7206 1327.1822 1363.2858 1405.2355 1432.4837 1436.4244 1443.5725 1451.9578 1464.8758 1465.8443 1468.7086 1470.9367 1479.7140 1484.3423 1495.2684 1596.6890 1624.4782 2884.1176 2904.5353 2954.4426 2994.1953 3015.5684 3018.3085 3040.4336 3043.8474 3063.0611 3077.3116 3123.8093 3131.8324 3150.3341 3167.0132 3442.2317
redmass: 3.9868 3.2522 2.9441 1.7887 3.5594 3.1542 2.8492 2.2169 1.3983 1.7440 2.9774 3.8670 2.4236 4.4407 2.9058 3.4798 5.5902 3.9958 4.1002 5.6253 4.6143 1.3551 3.0947 6.3369 1.4820 5.4416 1.8188 1.8859 2.7331 2.9804 2.8448 1.3598 2.1723 1.7191 4.0832 2.1765 1.8472 1.2519 1.2602 1.4578 2.2068 1.4156 3.4277 1.4209 1.6870 1.4340 1.4188 1.8891 1.8374 1.7697 1.3917 1.4487 7.4031 1.2222 1.1461 2.6435 1.2600 1.0571 1.2008 1.2110 1.1256 1.6883 1.0760 1.0528 7.2775 8.4602 1.0551 1.0684 1.0332 1.0643 1.0876 1.0783 1.1037 1.0895 1.0995 1.1000 1.0989 1.0859 1.0923 1.0976 1.0742
irintensity: 1.5955 1.1426 8.3696 3.1696 1.9175 1.6520 1.6343 3.7257 1.7582 1.8466 0.4254 0.3561 5.9814 8.2039 5.6449 0.6928 1.9461 2.6692 0.1876 3.6878 22.6436 86.3668 22.7881 12.6897 64.5419 11.1192 7.4938 14.0118 37.5175 13.6259 4.9661 2.2305 0.7204 21.4501 106.8358 35.0208 2.3578 38.6067 0.2666 20.4548 61.3089 23.0879 31.9989 49.2787 16.1941 6.4471 18.7260 52.5761 38.5776 36.7628 13.1205 3.3485 3.6155 9.3151 4.3140 65.1625 10.0523 11.6764 15.7021 8.3279 79.5550 38.3597 12.8389 11.0005 35.9391 40.7089 134.2444 85.5793 75.0120 21.5115 17.0059 30.9885 51.2176 61.6852 17.6812 41.3609 24.2725 2.2307 19.3110 20.5587 0.9200
temp: 298.150 k
press: 1.00000 atm
elementType: 8 8 7 6 6 6 6 6 6 6 6 6 6 6 1 1 1 1 1 1 1 1 1 1 1 1 1 1 1
symmnumber: 1
zpe: 631846.7 jmol-1
zpe.correction: 0.240658 hartree
zpe.thermalcorrener: 0.254436 hartree
zpe.thermalcorrenthalpy: 0.255381 hartree
zpe.thermalcorrgfe: 0.199557 hartree
zpe.sumelectzpe: -632.265123 hartree
zpe.sumelectthermal: -632.251344 hartree
zpe.sumelectthermalent: -632.250400 hartree
zpe.sumelectthermalfe: -632.306223 hartree
dipole: 0.5154 0.1937 0.7157
dipole: 0.9030
quadrupole: -61.9087 -82.8726 -83.3415
quadrupole: -0.0620 -5.2998 -1.4485
quadrupole: 14.1322 -6.8317 -7.3006 -0.0620 -5.2998 -1.4485
hfenergy: -632.5057804 hartree
pointgroup: C01 [X(C11H15N1O2)]
dipole: 0.2042054 0.0579344 0.2848809 debye
polarizability: 168.7606758|7.3018718|136.6581806|-15.988685|8.897249|90.7471209 unknown
InChI: InChI=1S/C11H15NO2/c1-12-7-9-6-8-4-3-5-10(13-2)11(8)14-9/h3-5,9,12H,6-7H2,1-2H3
charge 0 multiplicity 1
29 atoms
O  0.347065 -0.937359 -1.061724
O  -2.250886 -1.790305 -0.279897
N  3.921064 -0.168387 -0.124178
C  1.653274 -0.173938 -1.112789
C  1.298532 1.32143 -0.869689
C  -0.105868 1.242583 -0.283866
C  2.574658 -0.76728 -0.028916
C  -0.582384 -0.072583 -0.454464
C  -0.923753 2.227671 0.303797
C  -1.885845 -0.455051 -0.056693
C  -2.228523 1.862622 0.712188
C  -2.707414 0.540517 0.5337
C  4.81394 -0.468197 1.012407
C  -3.602864 -2.183295 0.120508
H  2.067731 -0.362286 -2.11922
H  1.300185 1.899887 -1.812827
H  2.045918 1.775645 -0.196354
H  2.563633 -1.878989 -0.123901
H  2.154801 -0.522612 0.966282
H  -0.561726 3.252092 0.439618
H  4.366092 -0.382765 -1.026912
H  -2.88509 2.607844 1.174128
H  -3.721302 0.291005 0.861438
H  5.79756 0.005846 0.8463
H  4.978892 -1.557798 1.194483
H  4.387585 -0.037868 1.937247
H  -4.371548 -1.604727 -0.428923
H  -3.754911 -2.056779 1.210755
H  -3.680217 -3.248123 -0.143799
