program: Gaussian 09
title: 000036899
version: EM64L-G09RevD.01
frameworkgroup: C1[X(C22H21N2O)]
method: RPBEPBE
basis: SDD
operation: Freq
keyword: #p
keyword: freq=noraman
keyword: PBEPBE/SDD
title: #p freq=noraman PBEPBE/SDD
converged: YES YES NO NO
title: Mulliken charges:
elementType: O N N C C C C C C C C C C C C C C C C C C C C C C H H H H H H H H H H H H H H H H H H H H H
charge: -0.331644 -0.148041 -0.393250 -0.428014 -0.340215 0.284942 -0.208188 0.263269 -0.018663 0.497591 0.465759 -0.314494 -0.311329 -0.199238 -0.437865 -0.430054 -0.354224 -0.389696 -0.186982 -0.220752 -0.217386 -0.229311 -0.239205 -0.231126 -0.233197 0.242254 0.271098 0.221527 0.237142 0.227933 0.351071 0.370267 0.257720 0.266993 0.235885 0.237125 0.240667 0.223825 0.260494 0.262724 0.242948 0.242770 0.238262 0.229943 0.245801 0.244863
chargesum: 1.00000
title: Mulliken charges with hydrogens summed into heavy atoms:
elementType: O N N C C C C C C C C C C C C C C C C C C C C C C
charge: -0.331644 -0.148041 -0.022983 0.085338 -0.118688 0.284942 0.256886 0.263269 0.332408 0.497591 0.465759 -0.056773 -0.044336 0.061256 -0.201980 -0.192929 -0.113557 -0.165871 0.075742 0.022196 0.025384 0.008951 -0.009262 0.014675 0.011666
polarizability: 2.69455609e+02 -2.01816759e+01 2.62091432e+02 -3.90162833e+01 -2.37866223e+01 1.95286775e+02
1716.lowfreq: -5.0093 -3.8521 -0.0009 -0.0005 -0.0002 9.6322 11.6456 18.9322 30.4938
frequency: 11.5587 18.6526 30.4904 38.4363 49.1178 53.0746 69.7221 101.9301 129.7595 146.8061 179.6287 216.3813 223.1826 244.3415 256.1551 268.3119 311.5456 326.0421 387.0727 401.7884 405.6607 417.4317 455.5522 474.7507 487.1154 540.2843 557.4189 568.0128 576.4845 606.0783 614.8241 618.7856 629.1740 646.9331 688.0323 694.9935 703.5674 709.8382 752.1885 755.2350 760.3976 764.6047 770.5736 814.4138 830.7107 838.3135 851.6951 858.6701 862.8285 865.4451 876.6495 925.3715 929.5453 943.6661 956.3222 976.0472 978.8616 979.7424 990.3418 991.0094 1002.3573 1003.1780 1005.1643 1013.3401 1025.7445 1027.3895 1030.8541 1066.2106 1077.9936 1086.7122 1091.3038 1114.9890 1155.3507 1176.2355 1176.9843 1179.0785 1182.9282 1185.9950 1192.3312 1202.1075 1215.1363 1224.7435 1240.4763 1271.6581 1275.8441 1294.7495 1303.2534 1329.8820 1342.8608 1351.7243 1356.2933 1371.7287 1385.2837 1389.1517 1410.3714 1426.5699 1440.7678 1444.4227 1458.7856 1462.4983 1473.0571 1481.0470 1483.2367 1492.2172 1531.7340 1593.2844 1594.2633 1608.0519 1614.0595 1615.7249 1631.8393 2965.9731 2970.0468 3029.3051 3047.3644 3112.2821 3112.8095 3122.5867 3125.0743 3134.4602 3141.8717 3146.2372 3152.2548 3156.3216 3159.7296 3166.8614 3171.4051 3172.0418 3177.4413 3189.3339 3259.4005 3585.4096
redmass: 5.4589 5.1984 3.7355 5.0333 4.5752 4.5628 4.4221 4.5909 3.3997 5.8981 4.0006 4.8229 4.2384 3.2178 4.0814 4.8497 2.8230 4.9003 4.3170 2.8121 2.8644 2.9010 4.0829 3.6692 3.5539 4.4521 4.2751 3.6976 3.7185 4.9528 6.2876 5.6605 3.3299 4.7852 1.2128 3.5938 1.7498 1.8267 1.9265 4.1689 3.9331 1.3062 2.3619 3.7142 2.7300 1.5059 1.2540 1.2678 1.5307 2.9268 5.0115 1.5671 1.5560 2.7153 1.3701 1.9850 1.5298 1.4700 5.3236 5.6904 1.3402 1.3380 1.3398 2.0919 2.3575 2.1849 4.0791 2.8639 1.6086 2.3236 1.6537 1.7094 1.2802 1.0897 1.2417 1.1404 1.8883 1.1051 1.1324 1.2449 1.8495 1.4117 2.2360 1.6268 1.4017 1.4933 3.0887 1.2600 1.3796 1.3315 1.5036 1.4639 6.2930 5.1532 3.6589 3.9352 2.1634 2.0869 2.2855 1.2654 1.0919 2.2022 2.3589 2.4481 3.8024 5.8503 6.2000 6.0302 6.1707 7.0322 7.1488 1.0853 1.0576 1.0982 1.0686 1.1045 1.0894 1.0858 1.0892 1.0859 1.0916 1.0905 1.0950 1.0957 1.0877 1.0909 1.1011 1.1014 1.0967 1.1008 1.1040 1.0832
irintensity: 0.3778 1.0322 0.0270 2.6743 3.1047 0.4777 0.5396 4.5482 2.2079 1.8907 8.5337 9.3004 10.2530 4.8282 0.6398 0.6432 1.9009 1.7828 0.6105 0.2376 0.7230 13.8631 4.7712 1.8566 17.6398 0.7982 4.3803 3.6887 4.2144 13.9585 2.3270 4.1044 6.1862 40.0518 93.2914 1.2126 37.7788 67.4813 52.0632 4.5364 39.0714 142.3705 41.6287 3.5136 1.9373 5.4913 0.2299 2.0099 0.1466 10.9125 0.8843 28.9212 32.9370 68.3253 4.1684 7.2068 2.2185 2.9408 2.1951 1.8104 0.0459 0.1295 0.0515 11.1081 5.9917 16.3176 73.3188 13.8160 0.1079 5.3455 13.8651 24.5686 1.5469 1.0239 4.6360 2.7261 11.8773 1.9518 1.7785 15.6122 10.2319 5.0643 5.3453 12.5835 25.9986 19.5779 8.0953 9.8302 0.5060 20.1115 15.5522 0.4506 0.8681 0.1076 32.0893 26.0305 15.2880 8.2420 12.9919 25.0340 4.4250 10.2842 10.8820 7.2530 43.1335 0.1892 2.1580 0.4297 1.3651 16.9144 2.5391 29.6865 30.4304 11.0197 18.9607 4.2045 8.6630 13.9348 5.7796 1.1420 16.3692 4.5199 23.4748 25.1291 0.2055 1.4558 17.2556 11.8504 2.0326 1.3690 89.9339 131.8796
temp: 298.150 k
press: 1.00000 atm
elementType: 8 7 7 6 6 6 6 6 6 6 6 6 6 6 6 6 6 6 6 6 6 6 6 6 6 1 1 1 1 1 1 1 1 1 1 1 1 1 1 1 1 1 1 1 1 1
symmnumber: 1
zpe: 988957.3 jmol-1
zpe.correction: 0.376674 hartree
zpe.thermalcorrener: 0.397464 hartree
zpe.thermalcorrenthalpy: 0.398408 hartree
zpe.thermalcorrgfe: 0.323318 hartree
zpe.sumelectzpe: -1033.699504 hartree
zpe.sumelectthermal: -1033.678713 hartree
zpe.sumelectthermalent: -1033.677769 hartree
zpe.sumelectthermalfe: -1033.752859 hartree
dipole: -9.2737 -1.3608 -1.1053
dipole: 9.4379
quadrupole: -75.5841 -109.2563 -125.2644
quadrupole: 4.6441 -9.8545 -11.3899
quadrupole: 27.7842 -5.8880 -21.8961 4.6441 -9.8545 -11.3899
hfenergy: -1034.0761775 hartree
pointgroup: C01 [X(C22H21N2O1)]
dipole: -3.4261564 -1.3664851 -0.426326 debye
polarizability: 281.5203433|-19.8439474|239.5553417|-23.7100635|-42.05439|205.7581313 unknown
InChI: InChI=1S/C22H21N2O/c1-3-9-18(10-4-1)22(19-11-5-2-6-12-19)25-16-15-24-17-23-20-13-7-8-14-21(20)24/h1-14,17,22-23H,15-16H2
charge 1 multiplicity 1
46 atoms
O  0.589007 -0.179544 -1.015241
N  -2.129541 -0.957858 -1.047369
N  -2.343103 -2.349759 0.665946
C  -1.503218 -0.229837 -2.182127
C  1.982073 0.375632 -0.887175
C  -3.448468 -0.787755 -0.547319
C  -0.353697 0.682356 -1.72644
C  -3.585082 -1.685018 0.55432
C  -1.49379 -1.896458 -0.297497
C  1.975292 1.792741 -0.31141
C  2.76551 -0.646944 -0.075768
C  -4.510954 0.046565 -0.950778
C  -4.78042 -1.785972 1.292641
C  -5.707355 -0.052634 -0.212738
C  2.331643 2.880081 -1.148027
C  4.117713 -0.903542 -0.408733
C  1.606977 2.051664 1.034226
C  2.188626 -1.325207 1.028544
C  -5.840497 -0.951133 0.886878
C  2.322846 4.204447 -0.653769
C  4.884617 -1.815542 0.35003
C  1.587484 3.373839 1.52681
C  2.952263 -2.242624 1.783665
C  1.946084 4.454212 0.68494
C  4.303767 -2.489357 1.448621
H  -2.28753 0.360278 -2.682561
H  -1.121476 -0.977062 -2.898301
H  2.401195 0.424259 -1.914614
H  -0.706807 1.505145 -1.074849
H  0.105903 1.127158 -2.633343
H  -0.459412 -2.195972 -0.443984
H  -2.104373 -3.064314 1.354677
H  -4.426934 0.741367 -1.790773
H  -4.889187 -2.473414 2.136211
H  2.632981 2.691336 -2.1868
H  4.577744 -0.385664 -1.259143
H  1.357263 1.220565 1.702017
H  1.144152 -1.128404 1.296717
H  -6.558167 0.576427 -0.490553
H  -6.790441 -0.992527 1.427706
H  2.612223 5.034529 -1.306824
H  5.929978 -2.002276 0.082909
H  1.309081 3.564074 2.569052
H  2.50153 -2.757075 2.639972
H  1.941771 5.478354 1.072866
H  4.897728 -3.196735 2.036787
