program: Gaussian 09
title: 000036793
version: EM64L-G09RevD.01
frameworkgroup: C1[X(C12H17NO2)]
method: RPBEPBE
basis: SDD
operation: Freq
keyword: #p
keyword: freq=noraman
keyword: PBEPBE/SDD
title: #p freq=noraman PBEPBE/SDD
converged: YES YES NO NO
title: Mulliken charges:
elementType: O O N C C C C C C C C C C C C H H H H H H H H H H H H H H H H H
charge: -0.260499 -0.250212 -0.293104 -0.078485 -0.545788 0.261508 -0.407037 0.071542 -0.425687 0.218843 -0.319202 -0.236844 -0.353537 -0.687531 -0.535684 0.228340 0.234119 0.263359 0.225056 0.222917 0.243604 0.238975 0.213094 0.184315 0.219324 0.239117 0.203336 0.230804 0.213978 0.219134 0.217809 0.244435
chargesum: 0.00000
title: Mulliken charges with hydrogens summed into heavy atoms:
elementType: O O N C C C C C C C C C C C C
charge: -0.260499 -0.250212 -0.049500 0.149855 -0.048311 0.261508 0.040936 0.071542 -0.186712 0.218843 0.078207 -0.017520 -0.114419 -0.039413 0.145694
polarizability: 1.86495147e+02 -5.34369191e+00 1.46346688e+02 -1.75540139e+01 -4.79228498e+00 9.94309730e+01
1716.lowfreq: -3.9882 0.0001 0.0003 0.0007 6.9076 8.1983 28.2000 44.3963 54.2207
frequency: 28.1331 44.2778 54.1835 84.3764 106.9500 128.5291 159.3108 183.5628 199.3268 240.7866 249.3844 274.5080 290.0204 306.5458 339.5714 431.2676 456.7553 474.6526 502.0437 527.1505 547.1961 598.0080 647.6645 685.5548 714.7932 734.6768 757.5379 806.1187 809.4791 853.8285 860.9886 892.3305 900.4393 909.8902 938.4807 945.5625 1035.7279 1043.6287 1051.0334 1063.0961 1079.1266 1106.3152 1110.7779 1116.1740 1146.3212 1148.8701 1153.5698 1187.2402 1196.7399 1214.8340 1237.0604 1255.3329 1266.3562 1280.7253 1285.5099 1319.7097 1341.9608 1380.4414 1392.4283 1405.6470 1432.7593 1443.5935 1450.8877 1465.0933 1466.9678 1470.7221 1472.4600 1479.4692 1480.0256 1485.1092 1498.0447 1596.7540 1624.4187 2866.7412 2907.0783 2954.5991 2979.0226 2994.1509 3002.5107 3016.0356 3040.5856 3043.7206 3062.1999 3071.4728 3093.1563 3123.7617 3131.5871 3150.1994 3167.0423 3416.6272
redmass: 4.1679 3.4304 1.7975 2.7607 3.2935 3.3091 3.0469 4.0191 1.9583 1.8379 1.1498 2.6588 2.7444 4.1451 3.8796 2.9838 3.5485 3.4301 4.7957 4.0336 4.0956 5.6360 4.5885 1.4068 3.0409 6.3578 1.4940 1.4467 2.4899 2.0384 1.7205 1.9293 2.4716 3.3236 1.4508 2.1305 3.3182 1.8118 3.6919 2.1663 1.8455 1.3853 1.2621 1.6887 2.5429 2.4949 1.4655 1.4179 1.7768 1.4460 1.3981 1.5445 1.4972 1.4325 2.0419 1.3548 1.3989 1.3734 1.3053 7.0692 1.2229 2.5721 1.2477 1.0526 1.3284 1.1595 1.0572 1.3415 1.2845 1.0788 1.0849 7.2840 8.4620 1.0718 1.0685 1.0332 1.0374 1.0642 1.0873 1.0896 1.1037 1.0896 1.0995 1.0979 1.1003 1.0989 1.0859 1.0924 1.0976 1.0739
irintensity: 0.8695 1.2332 0.2756 7.3966 2.7756 1.7927 2.4658 4.4685 1.9674 1.8341 1.3554 1.8812 3.7284 1.3604 2.5122 0.7554 2.2170 3.8267 0.8708 2.8071 0.1809 3.8692 20.0952 67.1300 23.8031 13.0863 63.5989 0.9868 17.3973 11.0708 10.6435 6.1477 31.1248 9.9653 2.9854 11.7233 1.5187 16.7393 108.9488 36.7753 4.0430 29.7042 0.5426 20.4601 127.9452 20.9653 17.5765 51.7900 9.1516 6.0176 10.5869 48.6005 20.9675 13.1052 59.5558 18.0412 4.5028 4.2763 24.8392 3.4067 9.7828 77.8640 9.0890 12.5150 11.2527 87.3896 13.3405 30.2685 12.8056 3.2057 5.8559 37.2510 40.6375 112.3839 75.8406 76.2952 32.0081 21.2904 24.4431 5.9926 51.1204 60.4579 19.1392 52.8138 38.7817 24.2763 2.2335 19.3788 20.7785 1.8109
temp: 298.150 k
press: 1.00000 atm
elementType: 8 8 7 6 6 6 6 6 6 6 6 6 6 6 6 1 1 1 1 1 1 1 1 1 1 1 1 1 1 1 1 1
symmnumber: 1
zpe: 705134.7 jmol-1
zpe.correction: 0.268572 hartree
zpe.thermalcorrener: 0.283715 hartree
zpe.thermalcorrenthalpy: 0.284659 hartree
zpe.thermalcorrgfe: 0.225153 hartree
zpe.sumelectzpe: -671.491576 hartree
zpe.sumelectthermal: -671.476432 hartree
zpe.sumelectthermalent: -671.475488 hartree
zpe.sumelectthermalfe: -671.534994 hartree
dipole: -0.5697 0.2321 -0.7324
dipole: 0.9565
quadrupole: -69.4015 -89.2481 -89.3226
quadrupole: 0.3793 -6.0943 1.2971
quadrupole: 13.2559 -6.5907 -6.6652 0.3793 -6.0943 1.2971
hfenergy: -671.7601474 hartree
pointgroup: C01 [X(C12H17N1O2)]
dipole: 0.2229783 0.0680272 0.2954254 debye
polarizability: 185.8890555|8.489025|145.3499964|-17.4577536|8.9661726|101.033756 unknown
InChI: InChI=1S/C12H17NO2/c1-3-13-8-10-7-9-5-4-6-11(14-2)12(9)15-10/h4-6,10,13H,3,7-8H2,1-2H3
charge 0 multiplicity 1
32 atoms
O  -0.119784 -0.938457 -1.107418
O  -2.699342 -1.764404 -0.242313
N  3.498165 -0.20978 -0.312997
C  1.19117 -0.187942 -1.206885
C  0.861938 1.310237 -0.944487
C  -0.522889 1.244841 -0.312313
C  2.149478 -0.795359 -0.163704
C  -1.018726 -0.064879 -0.46851
C  -1.309793 2.237493 0.304213
C  -2.312466 -0.433834 -0.028277
C  4.441691 -0.524425 0.785314
C  -2.603948 1.885806 0.755585
C  -3.102966 0.569287 0.590899
C  5.816029 0.115476 0.525574
C  -4.042531 -2.1434 0.198909
H  1.563564 -0.37642 -2.229535
H  0.839134 1.893809 -1.884168
H  1.636498 1.753066 -0.294555
H  2.121866 -1.906121 -0.261918
H  1.773487 -0.549894 0.848666
H  3.910149 -0.441431 -1.229188
H  -0.932304 3.257681 0.429433
H  4.0137 -0.120487 1.723656
H  4.566282 -1.625544 0.940499
H  -3.236569 2.637128 1.240478
H  -4.108225 0.330207 0.951278
H  6.273957 -0.283766 -0.400111
H  5.715803 1.209262 0.413621
H  6.509916 -0.093435 1.359459
H  -4.821283 -1.554361 -0.324643
H  -4.159177 -2.01884 1.293717
H  -4.140224 -3.206415 -0.065981
