program: Gaussian 09
title: 000036777
version: EM64L-G09RevD.01
frameworkgroup: C1[X(C11H13Cl2NO)]
method: RPBEPBE
basis: SDD
operation: Freq
keyword: #p
keyword: freq=noraman
keyword: PBEPBE/SDD
title: #p freq=noraman PBEPBE/SDD
converged: YES YES NO NO
title: Mulliken charges:
elementType: Cl Cl O N C C C C C C C C C C C H H H H H H H H H H H H H
charge: -0.025894 -0.062879 -0.253519 -0.298000 -0.076960 -0.544347 -0.402557 0.285220 0.330844 -0.404672 -0.281091 -0.321795 -0.091868 -0.225828 -0.685850 0.238087 0.244216 0.273206 0.229682 0.222036 0.247634 0.269882 0.214844 0.188430 0.278681 0.204642 0.230635 0.217221
chargesum: 0.00000
title: Mulliken charges with hydrogens summed into heavy atoms:
elementType: Cl Cl O N C C C C C C C C C C C
charge: -0.025894 -0.062879 -0.253519 -0.050366 0.161127 -0.026925 0.049161 0.285220 0.330844 -0.134790 -0.281091 0.081479 -0.091868 0.052853 -0.033351
polarizability: 1.90585620e+02 8.51544976e+00 1.59966884e+02 1.84409755e+01 -6.12273937e+00 9.35759752e+01
1716.lowfreq: -8.2171 -0.0032 -0.0029 -0.0009 2.5860 6.2008 23.6745 43.8552 63.5245
frequency: 23.5618 43.7905 63.4463 87.0793 116.3384 135.4592 155.1601 164.5165 196.4008 213.0790 251.3185 277.7434 290.9522 333.0221 360.0398 387.1507 426.0100 467.2984 474.8608 492.3167 547.2149 605.6738 675.3151 691.8806 703.1061 727.9663 809.2753 817.6424 851.0346 853.1842 868.0282 892.1566 901.3333 902.7931 945.0630 1035.7094 1044.6277 1068.0365 1077.7220 1106.6819 1115.4227 1127.1521 1147.2272 1194.7661 1204.3500 1218.3914 1239.7210 1261.6236 1274.7763 1282.0978 1320.4093 1342.0022 1369.6233 1381.9544 1393.3260 1414.5179 1439.1545 1451.6535 1467.5457 1473.6311 1479.8818 1484.5281 1498.2732 1582.0677 1609.9934 2875.9091 2912.4236 2980.2955 3001.0852 3007.0583 3017.0949 3055.7148 3069.5327 3073.3927 3094.3557 3168.7320 3182.1124 3419.8322
redmass: 4.9312 4.7929 1.9668 2.8769 4.0364 5.9503 3.4980 11.2144 5.4905 3.8714 1.1257 5.0424 3.1392 7.8072 9.1896 10.1546 2.7602 3.2918 3.5244 4.3633 4.0962 6.1693 2.1758 2.4398 5.0070 7.0742 1.1793 4.9268 2.6888 1.4022 1.4881 1.8687 2.4079 4.0867 2.2339 3.2611 1.6615 2.0023 1.8375 1.4466 1.7010 3.1164 3.1912 1.6126 1.5838 1.4827 1.8506 1.5220 1.3377 1.3652 1.3633 1.3985 5.6619 1.3686 1.3066 4.8449 3.5611 1.1975 1.1173 1.0575 1.0685 1.0740 1.0848 8.4378 9.3814 1.0714 1.0682 1.0374 1.0634 1.0879 1.0909 1.0903 1.0994 1.0980 1.1003 1.0936 1.0932 1.0739
irintensity: 0.0384 0.3658 0.7271 1.4616 1.4822 0.4205 2.1796 1.4305 2.8865 1.5105 0.6931 1.4139 8.6741 1.2221 2.5340 3.0171 2.6497 3.1309 4.4472 0.9424 3.2472 9.3352 88.6991 29.1522 17.8202 33.6943 14.3571 16.7497 10.8551 25.4602 22.0920 9.2375 30.7981 1.6542 51.5378 1.2526 26.1003 2.0031 7.8208 34.5105 32.6194 70.0116 77.9150 21.8423 12.2296 0.3195 9.5293 39.9259 24.1670 2.2049 20.9886 6.0024 21.5810 3.7048 27.3582 27.5308 158.6141 13.3026 32.4983 16.1218 6.3735 1.5345 6.4274 48.2207 2.6538 106.7283 71.4011 30.7254 15.4882 23.1710 10.9416 37.9078 20.3797 50.6768 37.6265 0.4734 0.6156 1.1345
temp: 298.150 k
press: 1.00000 atm
elementType: 17 17 8 7 6 6 6 6 6 6 6 6 6 6 6 1 1 1 1 1 1 1 1 1 1 1 1 1
symmnumber: 1
zpe: 572506.5 jmol-1
zpe.correction: 0.218056 hartree
zpe.thermalcorrener: 0.233108 hartree
zpe.thermalcorrenthalpy: 0.234052 hartree
zpe.thermalcorrgfe: 0.173839 hartree
zpe.sumelectzpe: -1475.921930 hartree
zpe.sumelectthermal: -1475.906878 hartree
zpe.sumelectthermalent: -1475.905934 hartree
zpe.sumelectthermalfe: -1475.966147 hartree
dipole: 4.5392 -1.1043 0.6713
dipole: 4.7195
quadrupole: -95.2863 -109.5637 -100.6005
quadrupole: -0.4318 1.0535 -0.9915
quadrupole: 6.5306 -7.7469 1.2164 -0.4318 1.0535 -0.9915
hfenergy: -1476.1399858 hartree
pointgroup: C01 [X(C11H13Cl2N1O1)]
dipole: 1.7656137 0.4931509 -0.2952133 debye
polarizability: 186.1269689|-1.8160471|158.0630242|-28.4418614|12.8363198|99.9384858 unknown
InChI: InChI=1S/C11H13Cl2NO/c1-2-14-6-9-4-7-3-8(12)5-10(13)11(7)15-9/h3,5,9,14H,2,4,6H2,1H3
charge 0 multiplicity 1
28 atoms
Cl -2.37498 -2.997133 -0.064023
Cl -4.0180 2.091945 1.501611
O  0.155397 -1.375782 -1.057194
N  3.556034 0.099716 -0.324042
C  1.306758 -0.398583 -1.216867
C  0.699343 1.02184 -1.030706
C  2.363689 -0.754874 -0.153138
C  -0.634317 0.730912 -0.356865
C  -0.876721 -0.662998 -0.439855
C  -1.577889 1.589553 0.230056
C  -2.069585 -1.215395 0.053817
C  4.511595 0.078586 0.809905
C  -2.767982 1.010348 0.726652
C  -3.034229 -0.371246 0.648282
C  5.720087 0.985002 0.522227
H  1.699969 -0.572558 -2.233179
H  0.543813 1.530481 -2.000313
H  1.387509 1.641685 -0.430835
H  2.570823 -1.848981 -0.209726
H  1.937429 -0.558589 0.850126
H  4.038037 -0.093639 -1.214444
H  -1.409071 2.667446 0.300615
H  3.976998 0.444429 1.708119
H  4.867794 -0.95414 1.048617
H  -3.964478 -0.788491 1.041328
H  6.285538 0.630658 -0.361241
H  5.387916 2.019156 0.324429
H  6.414322 0.994748 1.381345
