program: Gaussian 09
title: 000036883
version: EM64L-G09RevD.01
frameworkgroup: C1[X(C25H29NO2)]
method: RPBEPBE
basis: SDD
operation: Freq
keyword: #p
keyword: freq=noraman
keyword: PBEPBE/SDD
title: #p freq=noraman PBEPBE/SDD
converged: NO YES NO NO
title: Mulliken charges:
elementType: O O N C C C C C C C C C C C C C C C C C C C C C C C C C H H H H H H H H H H H H H H H H H H H H H H H H H H H H H
charge: -0.438286 -0.327321 -0.522527 0.230998 -0.112097 -0.097228 -0.097884 -0.541940 -0.526339 -0.527222 -0.454376 -0.452926 -0.451495 0.557037 -0.715162 -0.634264 0.393679 0.254401 0.092297 -0.858343 -0.847548 0.324181 0.042618 -0.370638 -0.301931 -0.220096 0.138385 -0.263133 0.194197 0.197343 0.195501 0.202041 0.200129 0.207552 0.214397 0.213581 0.204828 0.195605 0.194534 0.194254 0.195321 0.196383 0.191438 0.256711 0.271997 0.229029 0.231366 0.233516 0.381495 0.242412 0.246022 0.245632 0.276709 0.272564 0.227222 0.232110 0.383272
chargesum: 0.00000
title: Mulliken charges with hydrogens summed into heavy atoms:
elementType: O O N C C C C C C C C C C C C C C C C C C C C C C C C C
charge: -0.055014 -0.327321 -0.141032 0.230998 0.082099 0.100116 0.097618 -0.139770 -0.104390 -0.108814 -0.064237 -0.063351 -0.063675 0.557037 -0.458451 -0.362267 0.393679 0.254401 0.092297 -0.164432 -0.113482 0.324181 0.042618 -0.093930 -0.029367 0.007126 0.138385 -0.031023
polarizability: 3.69129841e+02 2.57701573e+01 3.19901113e+02 -2.24977228e+01 1.70199653e+01 1.97945026e+02
1716.lowfreq: -0.0006 -0.0006 -0.0003 3.0548 8.1932 12.4250 22.0096 30.7077 40.6823
frequency: 21.8923 30.1612 40.1709 51.4597 74.1202 88.4367 104.0163 112.7445 135.6195 141.6284 165.6338 185.1733 200.7372 220.1718 229.9465 249.1929 263.4491 287.8288 300.9597 307.2791 327.9551 338.4684 366.1016 378.1528 392.1953 399.9754 401.1741 423.4770 426.0822 431.6057 442.7811 496.6482 509.0215 518.1346 530.7386 550.2422 570.4061 582.2687 596.4151 614.9842 634.1814 641.2276 643.4868 671.0756 681.4618 717.7087 728.9287 742.8412 759.4829 772.2636 780.0103 798.1325 807.8941 812.0302 815.5562 839.9251 863.4761 869.6830 873.6143 876.9788 881.4103 911.2760 924.3382 940.3931 946.1748 950.6552 968.2880 972.0632 974.6925 983.0631 991.0490 998.4180 1006.1693 1026.1722 1039.6984 1047.7040 1050.3449 1051.0859 1051.8549 1059.2622 1086.9584 1101.2880 1104.1514 1106.3886 1108.0861 1112.9141 1119.3653 1153.5723 1165.3544 1176.5742 1181.6295 1183.4611 1221.8642 1243.5192 1249.4066 1257.9712 1275.6952 1286.1913 1288.3405 1294.0196 1297.3935 1312.7584 1314.3772 1316.9282 1318.2749 1323.2857 1339.0413 1340.3379 1344.0068 1353.3824 1358.8205 1361.0664 1367.0853 1392.3012 1397.0711 1404.5135 1419.7030 1441.3520 1443.2815 1450.1360 1454.3322 1460.3079 1462.5398 1465.5954 1466.6939 1467.1205 1480.9218 1483.4118 1486.9568 1495.5855 1522.1430 1579.4034 1584.1156 1598.2465 1622.9679 1638.9808 2955.3301 2958.7722 2960.5515 2961.3306 2962.2990 2967.8227 2968.7406 2971.9167 2988.7116 2990.2840 3002.5728 3014.2564 3015.1823 3018.3791 3024.8867 3025.7474 3031.3366 3044.7571 3047.3351 3081.3008 3101.3888 3131.0993 3142.8701 3148.1640 3155.8672 3171.3915 3180.2716 3282.0076 3532.4458
redmass: 5.6846 4.4312 3.8069 4.5642 3.3560 3.2156 1.9706 2.3378 3.3752 3.9583 4.8425 1.1619 4.4245 2.6420 3.6357 4.0991 4.1469 4.3339 2.5373 2.1806 3.1990 3.0021 2.7027 3.1727 6.8476 4.5834 4.6266 2.8258 1.9323 1.7879 1.7517 6.1309 4.0300 3.2791 4.4231 3.5104 1.1942 5.1962 4.5290 4.9997 4.3117 3.9180 4.0299 4.2584 4.3631 4.3580 3.0965 2.5836 3.4831 1.6100 4.3328 1.9973 2.6893 2.1514 2.4631 5.0850 1.5123 1.5850 1.5492 1.5649 1.5024 1.3903 3.4519 2.4495 2.0201 2.0974 2.1036 1.4258 2.0945 2.3221 1.3257 1.5563 5.2502 1.4410 2.2317 1.8303 1.7810 1.6741 1.7412 2.8830 2.3185 1.3072 1.3607 1.4459 1.0595 1.0531 1.7939 3.5336 1.5815 1.1194 1.2249 1.2335 1.7799 1.7985 1.5051 1.6650 1.4888 1.8175 1.8456 1.8821 2.5245 2.5250 1.6510 1.6604 2.0099 1.3259 1.4623 1.4833 2.6929 1.4969 1.6302 1.6256 4.6927 6.7481 1.3284 1.2034 3.3522 2.3625 2.4726 1.1197 1.0844 1.1868 1.2704 1.0915 1.0927 1.0794 1.4755 1.1033 1.0770 1.4001 3.3282 6.8825 6.2518 3.5223 4.4649 3.3584 1.0598 1.0650 1.0608 1.0617 1.0594 1.0433 1.0614 1.0379 1.0827 1.0827 1.0824 1.1032 1.1032 1.1029 1.1020 1.1022 1.1016 1.0923 1.0969 1.0982 1.0964 1.0871 1.0899 1.0905 1.0899 1.0937 1.0988 1.0791 1.0641
irintensity: 0.1410 0.1990 0.4091 0.6105 0.0999 0.0610 0.8675 0.3023 0.8030 0.0766 0.6439 1.2319 1.7410 1.2176 2.8067 0.6787 0.9822 2.1254 2.6795 0.4118 1.3830 1.1736 0.0288 1.7935 7.3482 0.1721 1.7086 12.2252 1.6553 0.1068 0.3965 16.5248 5.5752 9.0450 5.4394 4.8133 111.1948 1.2310 35.0250 27.5033 2.4151 0.4808 0.6684 2.9858 35.2845 2.6056 4.4273 7.8294 21.3926 74.0282 2.7059 35.2891 3.0998 40.2569 11.9354 2.5775 5.9155 0.4076 1.7219 0.0737 6.3585 3.3431 6.7515 0.8514 0.8792 2.4098 6.0023 0.5627 2.2986 14.7256 1.8435 12.1363 306.5049 8.6846 14.1783 0.2470 0.3699 3.7506 0.3113 11.5738 106.1665 2.4293 0.9865 11.4297 1.9170 0.4675 108.5590 8.7591 160.9554 3.1425 0.2328 0.4729 1.5465 8.4972 0.5361 0.5138 0.8785 0.0350 0.0387 0.0515 24.2617 8.0571 1.9586 12.8216 67.6228 0.2524 2.6328 3.6880 170.1313 9.3757 1.8093 2.4375 3.8637 1.9809 8.0585 16.1698 40.1809 32.3887 111.9868 6.5245 0.7847 29.7405 37.5611 14.1687 15.4295 32.5577 73.8875 5.3560 15.4051 17.4269 234.1053 225.5048 29.2352 247.6618 101.9458 151.3553 20.8237 11.5835 22.0174 44.5933 16.0217 27.8861 62.9438 39.6160 151.5728 153.6064 61.6046 2.5781 0.4745 10.9986 64.4088 114.9345 53.2741 22.4012 13.2426 24.1739 20.3176 8.3152 14.0967 6.6245 10.1229 7.0004 13.2247 155.7511 68.6845
temp: 298.150 k
press: 1.00000 atm
elementType: 8 8 7 6 6 6 6 6 6 6 6 6 6 6 6 6 6 6 6 6 6 6 6 6 6 6 6 6 1 1 1 1 1 1 1 1 1 1 1 1 1 1 1 1 1 1 1 1 1 1 1 1 1 1 1 1 1
symmnumber: 1
zpe: 1266425.0 jmol-1
zpe.correction: 0.482356 hartree
zpe.thermalcorrener: 0.506427 hartree
zpe.thermalcorrenthalpy: 0.507371 hartree
zpe.thermalcorrgfe: 0.429049 hartree
zpe.sumelectzpe: -1173.273511 hartree
zpe.sumelectthermal: -1173.249440 hartree
zpe.sumelectthermalent: -1173.248495 hartree
zpe.sumelectthermalfe: -1173.326818 hartree
dipole: 1.0454 -0.0135 -0.4767
dipole: 1.1490
quadrupole: -157.4716 -156.8577 -166.7725
quadrupole: 0.9266 -2.9772 1.2882
quadrupole: 2.8957 3.5096 -6.4052 0.9266 -2.9772 1.2882
hfenergy: -1173.7558665 hartree
pointgroup: C01 [X(C25H29N1O2)]
dipole: 0.4088316 0.0218694 0.1916639 debye
polarizability: 370.9223945|-23.8562312|317.3090553|23.1034302|19.0003453|198.7445298 unknown
InChI: InChI=1S/C25H29NO2/c1-15-7-20(25-12-17-8-18(13-25)10-19(9-17)14-25)11-23(16(15)2)26-22-6-4-3-5-21(22)24(27)28/h3-7,11,17-19,26-27H,8-10,12-14H2,1-2H3
charge 0 multiplicity 1
57 atoms
O  -6.143804 0.626755 -1.52389
O  -4.630499 -1.119348 -1.472634
N  -2.361231 -0.762968 -0.097674
C  2.616719 -0.027653 -0.043825
C  5.171375 0.201904 -0.071865
C  3.776405 1.658038 -1.599938
C  3.765764 2.067257 0.902192
C  3.977338 -0.77682 0.084732
C  2.587336 0.673521 -1.445237
C  2.575127 1.084164 1.060338
C  5.111799 0.879048 -1.46705
C  5.101933 1.288484 1.034128
C  3.698131 2.744697 -0.493392
C  1.40504 -0.969091 0.097023
C  1.534106 -2.363658 0.307687
C  0.094858 -0.445839 -0.020779
C  0.409922 -3.224059 0.393288
C  -1.042766 -1.280698 0.085065
C  -0.903373 -2.688451 0.289079
C  0.637074 -4.713922 0.60189
C  -2.142943 -3.562565 0.379993
C  -2.879536 0.454288 0.323095
C  -4.176075 0.892385 -0.158142
C  -2.200025 1.294297 1.263439
C  -4.709114 2.14123 0.276549
C  -2.75807 2.51077 1.678358
C  -4.947632 0.049537 -1.073975
C  -4.013412 2.956402 1.178461
H  6.117594 -0.366887 0.025368
H  3.721738 2.138067 -2.597332
H  3.70469 2.839922 1.69456
H  4.046265 -1.566267 -0.690898
H  4.039547 -1.277588 1.072311
H  1.632298 1.21901 -1.57425
H  2.624676 -0.100163 -2.238275
H  2.602786 0.605178 2.059972
H  1.619188 1.641308 0.995414
H  5.971166 1.567913 -1.593265
H  5.185034 0.112814 -2.265116
H  5.170581 0.817962 2.035847
H  5.959309 1.985006 0.93941
H  4.533351 3.464903 -0.606598
H  2.754855 3.319442 -0.591621
H  2.528599 -2.810499 0.398792
H  -0.053329 0.616273 -0.239924
H  0.202462 -5.06805 1.556533
H  0.178962 -5.316919 -0.204655
H  1.715286 -4.946483 0.622661
H  -3.024174 -1.323268 -0.662807
H  -1.915871 -4.549534 0.812122
H  -2.92035 -3.085834 1.004353
H  -2.597217 -3.739728 -0.616022
H  -1.249032 0.960579 1.685607
H  -5.686184 2.442086 -0.111417
H  -2.216478 3.120861 2.410667
H  -4.434836 3.911847 1.504886
H  -6.590563 -0.025061 -2.127541
