program: Gaussian 09
title: 000036767
version: EM64L-G09RevD.01
frameworkgroup: C1[X(C13H19NO)]
method: RPBEPBE
basis: SDD
operation: Freq
keyword: #p
keyword: freq=noraman
keyword: PBEPBE/SDD
title: #p freq=noraman PBEPBE/SDD
converged: YES YES NO NO
title: Mulliken charges:
elementType: O N C C C C C C C C C C C C C H H H H H H H H H H H H H H H H H H H
charge: -0.284143 -0.291817 -0.021565 -0.564349 -0.447719 0.242615 0.185482 -0.057694 -0.559281 -0.364429 0.454922 -0.368744 -0.685093 -0.701247 -0.819279 0.245415 0.242509 0.222579 0.233690 0.203131 0.245456 0.209128 0.241234 0.245576 0.231399 0.199710 0.214703 0.196158 0.208773 0.238376 0.228894 0.221464 0.222822 0.231323
chargesum: 0.00000
title: Mulliken charges with hydrogens summed into heavy atoms:
elementType: O N C C C C C C C C C C C C C
charge: -0.284143 -0.046361 0.223850 -0.099261 -0.010897 0.242615 0.185482 0.151434 -0.318047 -0.118854 0.454922 -0.139850 -0.039280 -0.057940 -0.143670
polarizability: 2.14249176e+02 -1.02360151e+00 1.41376479e+02 8.34636666e+00 -9.52574666e-01 9.79864171e+01
1716.lowfreq: -24.2250 -13.4335 -8.0113 -4.2635 -0.0008 -0.0003 0.0003 22.3631 33.8328
frequency: -23.7580 21.8720 33.8235 46.5014 75.7883 136.9673 169.5473 188.5523 209.7235 214.8758 221.3822 254.6538 296.0315 329.7271 370.3245 375.5487 418.5536 433.2663 461.2372 470.1083 504.0360 550.3142 595.2852 650.2716 664.1016 712.6668 734.1563 783.3925 814.0601 816.0605 846.6857 878.9944 897.9725 911.3395 914.1653 922.1530 936.6290 940.9991 958.9131 997.3434 1042.5866 1045.7972 1091.6455 1105.0714 1123.1458 1127.9490 1136.9889 1143.9523 1173.4557 1183.1070 1201.8919 1228.1945 1246.0826 1255.2041 1275.6421 1286.3154 1309.2617 1322.3384 1344.2691 1366.4784 1374.2101 1381.7529 1390.0217 1398.8505 1437.2169 1448.7289 1456.5091 1463.6765 1464.8072 1473.4421 1476.7275 1478.2421 1480.3202 1482.4405 1484.0421 1608.1440 1624.8436 2892.7912 2965.8843 2966.6618 2969.3358 2973.0853 2980.0725 3019.7008 3039.1816 3048.8427 3060.3889 3060.5786 3070.9643 3071.8054 3078.6937 3095.2489 3120.4346 3125.2717 3168.5485 3420.9146
redmass: 1.0236 3.5986 2.8507 3.3887 3.5410 3.1442 2.8391 2.6015 1.3503 1.8350 3.5877 1.1761 2.9173 4.5276 2.4055 2.6042 2.8239 2.6243 2.1786 4.0134 3.1151 3.1335 5.2765 2.6474 2.2394 3.7426 4.8017 5.0724 2.4975 1.4735 2.4933 1.4162 1.6699 1.3555 2.2024 2.6727 1.4351 1.3870 2.2282 1.4632 1.6650 1.5728 3.1588 2.8400 1.3854 2.2002 1.4105 2.0687 2.0108 1.6191 1.8041 1.6131 1.7630 1.4683 2.0275 1.3765 1.4179 1.2734 1.3962 1.5091 1.7907 2.1106 1.2312 1.2235 4.1560 1.1649 1.1331 1.0538 1.0515 1.0536 1.0785 1.2051 2.3701 1.0843 1.0601 7.3235 7.3099 1.0699 1.0672 1.0358 1.0393 1.0464 1.0752 1.0852 1.0912 1.0947 1.0956 1.0983 1.0974 1.0994 1.0995 1.1001 1.0917 1.0900 1.0952 1.0736
irintensity: 0.5442 0.1744 0.2492 0.0993 0.6548 0.9864 3.1216 0.6170 2.9998 2.4957 3.9523 0.1152 3.1285 1.7751 0.0611 5.5593 6.7788 0.2826 2.5141 1.3788 19.3644 2.4856 4.4363 31.7225 61.2518 2.6578 3.6032 4.0950 33.9736 39.4278 33.4444 3.9770 25.8778 2.0449 5.0560 21.0954 3.3552 1.1765 21.3629 1.0910 3.4808 18.0667 3.7091 46.9969 50.5841 19.8520 3.6932 10.5378 49.1205 57.1058 35.3668 74.4700 22.6492 4.1648 12.6526 3.2357 6.9018 11.1239 5.5668 14.8727 10.8427 5.7824 28.3339 6.2488 1.7031 34.5311 4.7482 0.7219 5.9113 13.0425 2.9652 31.0475 115.2733 17.6333 26.2460 0.4027 11.7750 63.9254 43.6705 25.9337 50.3591 18.7302 31.0799 17.3098 29.2481 25.7653 31.6856 4.1447 84.8488 54.6957 19.3319 35.7956 18.3570 18.4055 9.1950 1.7364
temp: 298.150 k
press: 1.00000 atm
elementType: 8 7 6 6 6 6 6 6 6 6 6 6 6 6 6 1 1 1 1 1 1 1 1 1 1 1 1 1 1 1 1 1 1 1
symmnumber: 1
zpe: 764532.1 jmol-1
zpe.correction: 0.291195 hartree
zpe.thermalcorrener: 0.306154 hartree
zpe.thermalcorrenthalpy: 0.307099 hartree
zpe.thermalcorrgfe: 0.247796 hartree
zpe.sumelectzpe: -635.600517 hartree
zpe.sumelectthermal: -635.585557 hartree
zpe.sumelectthermalent: -635.584613 hartree
zpe.sumelectthermalfe: -635.643916 hartree
dipole: -1.0005 -1.8473 0.9092
dipole: 2.2891
quadrupole: -80.3941 -88.6198 -95.0312
quadrupole: -0.9048 -0.9420 -0.7688
quadrupole: 7.6210 -0.6048 -7.0162 -0.9048 -0.9420 -0.7688
hfenergy: -635.8917116 hartree
pointgroup: C01 [X(C13H19N1O1)]
dipole: 0.3919286 0.7648649 0.2692285 debye
polarizability: 214.5293466|-2.393265|140.9174695|-5.595146|-4.6654117|98.1652557 unknown
InChI: InChI=1S/C13H19NO/c1-9(2)14-8-12-7-11-6-10(3)4-5-13(11)15-12/h4-6,9,12,14H,7-8H2,1-3H3
charge 0 multiplicity 1
34 atoms
O  -0.201039 -1.484909 -0.152818
N  3.102748 0.327655 -0.23747
C  0.774135 -0.40237 -0.566221
C  0.03775 0.954228 -0.328183
C  2.063284 -0.609772 0.237129
C  -1.419164 0.529534 -0.191131
C  -1.467933 -0.878413 -0.070046
C  4.511729 -0.012774 0.098023
C  -2.606396 1.277272 -0.130751
C  -2.676184 -1.569615 0.114946
C  -3.854316 0.616006 0.052809
C  -3.864175 -0.799293 0.172633
C  4.805958 -0.064774 1.623189
C  5.444194 0.986951 -0.615288
C  -5.147776 1.410201 0.144628
H  0.979523 -0.556245 -1.64161
H  0.211285 1.656502 -1.161353
H  0.393016 1.440138 0.603975
H  2.422193 -1.640983 0.061306
H  1.822043 -0.529003 1.323881
H  2.889303 1.303116 0.017482
H  4.695729 -1.022174 -0.323578
H  -2.58048 2.370074 -0.224404
H  -2.694655 -2.659742 0.201356
H  4.132776 -0.773621 2.138991
H  4.669693 0.934978 2.079971
H  5.846678 -0.387283 1.814162
H  5.281137 2.015394 -0.235971
H  6.504926 0.730994 -0.442411
H  5.249523 0.9856 -1.701506
H  -4.822953 -1.314598 0.308947
H  -5.087108 2.352496 -0.428826
H  -6.005592 0.833138 -0.244418
H  -5.383551 1.679691 1.193156
