program: Gaussian 09
title: 000036791
version: EM64L-G09RevD.01
frameworkgroup: C1[X(C13H19NO2)]
method: RPBEPBE
basis: SDD
operation: Freq
keyword: #p
keyword: freq=noraman
keyword: PBEPBE/SDD
title: #p freq=noraman PBEPBE/SDD
converged: YES YES NO NO
title: Mulliken charges:
elementType: O O N C C C C C C C C C C C C C H H H H H H H H H H H H H H H H H H H
charge: -0.259004 -0.250029 -0.316350 -0.087930 -0.545429 -0.406736 0.263187 0.070281 -0.018574 -0.425989 0.218223 -0.672087 -0.714596 -0.237041 -0.353506 -0.535833 0.226568 0.233395 0.264774 0.224163 0.221700 0.246795 0.184652 0.238960 0.206158 0.220091 0.217459 0.206314 0.215372 0.225195 0.219373 0.239094 0.219138 0.217807 0.244403
chargesum: 0.00000
title: Mulliken charges with hydrogens summed into heavy atoms:
elementType: O O N C C C C C C C C C C C C C
charge: -0.259004 -0.250029 -0.069555 0.138638 -0.047260 0.039127 0.263187 0.070281 0.166078 -0.187028 0.218223 -0.028379 -0.067714 -0.017668 -0.114412 0.145515
polarizability: 1.95842725e+02 3.85194294e+00 1.55144113e+02 -2.11625780e+01 3.46032220e+00 1.13983671e+02
1716.lowfreq: -13.3290 -5.4651 -0.0005 0.0002 0.0004 2.6408 15.3069 27.8696 42.7037
frequency: 11.8472 27.8667 42.6510 78.2747 97.8280 118.9696 153.0339 182.5310 191.5142 203.4961 234.1843 238.9553 264.4170 281.5406 307.1706 337.7284 374.4445 408.8700 455.2965 465.9723 483.8462 505.2356 527.7292 547.5054 597.6051 645.3961 673.9826 714.5985 734.8248 757.6592 803.3428 819.0413 856.3619 861.8286 899.9337 903.9971 914.1820 928.7838 939.8895 947.6929 963.0228 1050.0233 1056.9581 1063.9118 1074.7430 1091.3316 1110.8297 1120.7478 1145.2992 1147.6589 1153.2276 1175.7566 1187.5228 1197.7315 1209.2615 1237.7657 1257.6250 1275.0396 1284.9773 1310.5284 1331.5164 1338.5887 1364.0174 1377.0511 1388.6368 1405.4089 1433.2964 1443.2654 1450.1124 1464.8524 1466.0703 1466.6357 1469.4968 1470.9334 1476.7697 1479.6814 1482.4983 1492.4089 1596.6768 1624.1752 2855.1458 2905.8103 2955.3171 2973.4267 2982.0483 2994.2990 3028.7103 3041.2065 3047.4330 3063.4455 3065.6507 3077.4217 3084.3319 3091.1441 3123.4804 3131.6633 3150.0961 3166.7730 3409.8313
redmass: 3.1507 3.3027 3.4235 2.9930 3.4214 2.4328 2.8653 3.9578 1.5266 1.4689 1.2175 1.8110 2.4160 2.6856 3.6802 3.3856 2.3173 2.4588 3.4958 3.1026 3.0688 3.9332 3.9671 4.0944 5.6299 3.9529 1.5713 2.9974 6.5369 1.5091 3.9174 3.2112 1.5878 2.0875 2.7537 2.8828 1.1990 2.7385 1.3164 1.4394 2.1327 4.3044 1.8644 2.1176 2.1845 2.2808 1.2606 1.4066 2.3440 2.0095 1.4011 2.0117 1.4207 1.8710 1.3780 1.4301 1.7960 1.5834 2.0745 1.3542 1.4489 1.3613 1.3567 1.3269 1.2160 7.2948 1.2263 2.7185 1.1421 1.1184 1.0592 1.2318 1.1321 1.1405 1.1091 1.6741 1.0786 1.0664 7.2795 8.4405 1.0823 1.0698 1.0331 1.0363 1.0356 1.0644 1.0866 1.1037 1.0910 1.0993 1.0983 1.0989 1.1003 1.0995 1.0989 1.0859 1.0923 1.0977 1.0738
irintensity: 0.7616 0.2107 0.9000 2.8517 7.3175 1.9259 1.3263 4.0334 0.5153 1.9011 1.1350 1.1959 0.9399 2.6613 2.1442 1.4236 0.4835 7.2727 9.2710 3.3575 1.7633 0.8637 3.2578 0.2244 3.7982 24.9663 48.1931 23.4774 12.3499 62.7617 5.9566 12.6836 2.3335 14.1014 33.6795 15.7400 3.3792 1.7815 1.1344 2.3892 14.9274 90.7925 24.8539 35.5388 3.9139 10.8258 0.0807 22.7817 128.7775 15.2411 18.3221 34.4206 50.1871 4.9518 12.0973 12.6275 55.2329 19.4921 59.7130 20.7537 9.2754 21.0784 15.0418 30.7985 22.5528 3.0168 10.2221 73.1674 9.3965 4.2785 14.9470 3.5285 8.1598 82.2057 7.4328 34.1194 6.3210 16.2680 36.6317 41.5657 91.4803 69.6517 76.7195 37.9357 15.8727 21.3773 4.9189 51.4688 52.8644 15.1355 42.8817 46.9622 12.3956 68.0532 24.3246 2.2270 18.9893 20.9084 2.6755
temp: 298.150 k
press: 1.00000 atm
elementType: 8 8 7 6 6 6 6 6 6 6 6 6 6 6 6 6 1 1 1 1 1 1 1 1 1 1 1 1 1 1 1 1 1 1 1
symmnumber: 1
zpe: 776515.9 jmol-1
zpe.correction: 0.295759 hartree
zpe.thermalcorrener: 0.312363 hartree
zpe.thermalcorrenthalpy: 0.313307 hartree
zpe.thermalcorrgfe: 0.249640 hartree
zpe.sumelectzpe: -710.717373 hartree
zpe.sumelectthermal: -710.700770 hartree
zpe.sumelectthermalent: -710.699826 hartree
zpe.sumelectthermalfe: -710.763493 hartree
dipole: 0.6481 0.2826 0.6612
dipole: 0.9681
quadrupole: -76.7329 -96.0402 -95.2402
quadrupole: -0.9387 -7.4818 -1.6233
quadrupole: 12.6049 -6.7025 -5.9024 -0.9387 -7.4818 -1.6233
hfenergy: -711.0131327 hartree
pointgroup: C01[X(C13H19N1O2)]
dipole: 0.2540029 0.0292287 0.2822936 debye
polarizability: 195.0265391|12.2442853|149.4302304|-19.2620085|14.7559621|120.5137395 unknown
InChI: InChI=1S/C13H19NO2/c1-9(2)14-8-11-7-10-5-4-6-12(15-3)13(10)16-11/h4-6,9,11,14H,7-8H2,1-3H3
charge 0 multiplicity 1
35 atoms
O  -0.433597 -0.738914 -1.332116
O  -2.948618 -1.748091 -0.464441
N  3.209294 -0.071644 -0.598472
C  0.863368 0.040928 -1.374726
C  0.534246 1.469838 -0.853007
C  1.880582 -0.711977 -0.494657
C  -0.809403 1.2738 -0.161843
C  -1.301051 -0.001407 -0.50517
C  4.255628 -0.566763 0.341554
C  -1.566385 2.134742 0.656957
C  -2.561274 -0.463866 -0.056225
C  3.970772 -0.083921 1.780781
C  5.627428 -0.056617 -0.144473
C  -2.826613 1.687447 1.119654
C  -3.321589 0.406802 0.767695
C  -4.257727 -2.220096 -0.011235
H  1.181278 0.028588 -2.432594
H  0.447988 2.197199 -1.682268
H  1.341034 1.816497 -0.184326
H  1.874922 -1.7880 -0.788712
H  1.535514 -0.660334 0.554277
H  3.555897 -0.108701 -1.568908
H  4.282983 -1.68628 0.351511
H  -1.191459 3.127282 0.92769
H  4.759342 -0.440534 2.468742
H  3.946279 1.020481 1.807568
H  3.003536 -0.458666 2.160801
H  5.858412 -0.427769 -1.161942
H  6.432827 -0.397473 0.529648
H  5.63342 1.048532 -0.168793
H  -3.435175 2.335299 1.759791
H  -4.299846 0.091281 1.143389
H  -5.073016 -1.567023 -0.380398
H  -4.305645 -2.281279 1.094058
H  -4.363453 -3.226066 -0.443207
