program: Gaussian 09
title: 000036775
version: EM64L-G09RevD.01
frameworkgroup: C1[X(C10H10Cl3NO)]
method: RPBEPBE
basis: SDD
operation: Freq
keyword: #p
keyword: freq=noraman
keyword: PBEPBE/SDD
title: #p freq=noraman PBEPBE/SDD
converged: YES YES NO NO
title: Mulliken charges:
elementType: Cl Cl Cl O N C C C C C C C C C C H H H H H H H H H H
charge: 0.004040 -0.013067 -0.012664 -0.251064 -0.307947 -0.069685 -0.533814 0.405785 -0.401899 0.375675 -0.337305 -0.328668 -0.113080 -0.232065 -0.620348 0.241434 0.256892 0.286623 0.229777 0.222153 0.259865 0.280633 0.226919 0.200823 0.230988
chargesum: 0.00000
title: Mulliken charges with hydrogens summed into heavy atoms:
elementType: Cl Cl Cl O N C C C C C C C C C C
charge: 0.004040 -0.013067 -0.012664 -0.251064 -0.048082 0.171749 0.009701 0.405785 0.050031 0.375675 -0.337305 -0.328668 -0.113080 0.048568 0.038382
polarizability: 1.83132108e+02 -5.67772361e+00 1.72538903e+02 1.57593625e+01 4.78266564e+00 8.43504317e+01
1716.lowfreq: -5.4263 -2.6627 -0.0015 0.0019 0.0022 5.4930 27.6524 56.5151 68.8554
frequency: 27.6215 56.5065 68.8546 87.1292 102.4162 135.3353 161.1602 180.3088 192.9071 197.3752 230.2691 253.9467 297.0365 315.7045 342.0521 362.8181 400.1292 449.8726 476.3183 503.2372 533.6578 599.3275 625.1604 673.7988 704.0775 706.7699 735.9028 849.4311 852.0193 882.4548 899.8429 907.3100 930.4122 965.1735 1035.3813 1072.0118 1101.3095 1114.3442 1118.4845 1164.0337 1164.8627 1201.8627 1223.3452 1233.3398 1266.1212 1283.4311 1328.6040 1350.8326 1366.2269 1413.2095 1423.1000 1436.2986 1453.9200 1465.1338 1470.1040 1482.9261 1495.4514 1573.0292 1603.6842 2895.1743 2910.1578 3007.1740 3018.4711 3023.8750 3057.5551 3074.0329 3082.2616 3180.4022 3447.2643
redmass: 4.7549 4.7669 8.6479 1.9670 3.4651 6.6704 10.5627 14.3758 2.7337 4.9361 1.7711 4.5646 4.7440 10.3741 6.5539 5.3118 6.6459 2.4195 7.9345 3.9065 5.9986 10.9185 6.7143 1.3630 5.4750 5.3319 9.9039 3.3385 1.4133 3.8034 3.7090 3.0557 3.1865 2.1849 1.6292 1.8266 1.3071 3.2976 1.4374 3.3479 2.0521 1.7513 1.6799 2.2746 1.4177 1.5040 1.3998 8.1024 1.4515 4.2566 7.7276 1.1425 1.2042 1.0930 1.0805 1.0767 1.0503 8.8270 11.2686 1.0542 1.0679 1.0636 1.0901 1.0789 1.0898 1.0996 1.1000 1.0928 1.0744
irintensity: 0.2121 0.5358 0.1268 2.4015 1.7862 0.6634 0.1568 0.4099 2.1067 2.4238 2.9911 2.0524 1.3177 0.7260 1.3906 8.0201 10.1175 4.6062 6.1630 1.6006 17.1937 0.5786 5.0914 107.7256 20.6564 10.4228 43.7156 26.6425 18.5230 29.3326 11.7574 7.0427 51.6586 3.2432 29.1332 2.0283 61.8273 69.2409 19.8614 22.2500 60.6009 8.3445 2.0751 34.3937 25.3767 15.5288 12.4831 52.9545 9.0604 192.4924 14.8384 3.7107 14.0575 12.9048 15.8827 10.3965 13.9516 3.8375 13.3473 122.9952 84.4044 9.0740 15.0042 32.1946 39.9029 14.4222 37.6044 1.0646 0.3146
temp: 298.150 k
press: 1.00000 atm
elementType: 17 17 17 8 7 6 6 6 6 6 6 6 6 6 6 1 1 1 1 1 1 1 1 1 1
symmnumber: 1
zpe: 473982.9 jmol-1
zpe.correction: 0.180531 hartree
zpe.thermalcorrener: 0.195609 hartree
zpe.thermalcorrenthalpy: 0.196553 hartree
zpe.thermalcorrgfe: 0.136410 hartree
zpe.sumelectzpe: -1896.080490 hartree
zpe.sumelectthermal: -1896.065411 hartree
zpe.sumelectthermalent: -1896.064467 hartree
zpe.sumelectthermalfe: -1896.124610 hartree
dipole: -4.1897 -0.5914 -0.2096
dipole: 4.2364
quadrupole: -94.3353 -118.1630 -106.1195
quadrupole: 5.5342 1.1793 1.2849
quadrupole: 11.8706 -11.9571 0.0864 5.5342 1.1793 1.2849
hfenergy: -1896.2610201 hartree
pointgroup: C01 [X(C10H10Cl3N1O1)]
dipole: 1.64544 0.0964768 -0.2474395 debye
dipolederiv: -0.0659831 -0.0501236 0.0113202 0.0379451 -0.7047408 -0.0448203 0.0146983 -0.0264489 -0.033517 -0.0871346 -0.0484321 0.0164168 -0.0571326 -0.7679131 -0.0554748 0.0157688 -0.0362975 -0.042629 -0.5417271 0.2467689 0.21951 0.2509996 -0.205204 -0.1131731 0.242957 -0.1245625 -0.1364778 -1.4732937 0.1145619 0.258611 0.1610492 -0.3514121 -0.1139034 0.4174898 -0.1027132 -0.4147999 -0.6843234 -0.0252273 -0.2401965 -0.0768442 -0.5331841 0.0884495 -0.362339 0.0931154 -0.3318812 0.8301062 0.0304694 -0.0728686 0.3372919 0.2186808 -0.0395404 -0.0634759 0.0171514 0.3823743 -0.1342206 0.0520242 0.0517041 -0.0845284 -0.0800975 -0.0030255 0.0526651 -0.0200445 0.0920495 -0.0450736 -0.0340902 -0.0153948 0.4529042 -0.2269792 -0.1489019 -0.0251056 -0.0045555 -0.0358592 0.4096539 0.1149421 -0.0221568 -0.0123411 0.4030567 0.0489177 -0.0647514 -0.0231978 0.030801 1.021913 -0.2244249 -0.2912017 -0.7376681 -0.1402511 0.1811019 -0.4660265 0.0636603 0.2447506 0.0573282 0.1330028 -0.0268148 0.0259484 1.0109031 0.0247744 -0.0353284 0.0181517 -0.0436704 -0.0919056 0.2062016 -0.0111841 0.0705469 1.1611427 0.1043318 -0.0064925 0.0197986 -0.0917583 0.6246995 -0.3165825 -0.3185457 -0.475672 -0.0103315 0.2096688 -0.3403918 0.1544201 0.0856228 -0.1958331 -0.0588639 0.0481595 0.094557 -0.202218 -0.0616451 0.0690587 0.010161 -0.073884 0.3267662 -0.0778036 0.1610743 -0.0280626 0.2761423 0.0065777 0.3751785 -0.0066884 0.3731505 -0.0543718 0.0119012 0.0864223 -0.0012085 0.0587024 -0.0148268 0.094399 -0.0154376 -0.0973854 0.0122244 0.0109379 -0.0095024 0.0382384 0.0372427 0.0805015 0.0163803 0.0975431 -0.0583213 0.1239599 -0.0607256 -0.000553 -0.0619246 0.0519897 -0.0453065 -0.0236471 -0.0558075 0.0404641 -0.0546046 0.0581394 -0.0257273 -0.0018048 -0.2331001 -0.002626 -0.0103338 -0.0069505 0.0612908 0.0339962 -0.0124259 0.0697139 -0.000548 0.0391838 -0.0506045 0.1061987 -0.0099953 -0.0859756 0.101694 -0.0597134 0.0650247 -0.016742 0.2308209 -0.1556703 0.0602989 -0.0592102 0.0292405 0.0604896 -0.0324997 0.0432627 -0.0330326 0.0733356 0.0083601 0.0475666 0.0053684 0.1512524 -0.0949143 -0.1212 -0.0221519 -0.1603198 -0.0216447 0.0295455 0.020071 0.0478833 0.0746648 -0.0940791 0.0816017 -0.1052401 0.2230237 -0.1547835 0.1129019 -0.1685097 0.0244871 -0.0280543 0.0146335 0.0615615 0.1303183 0.0553251 0.0706588 -0.0456121 0.0336711 -0.0598309 -0.0914481 unknown
polarizability: 177.3231664|-3.1064203|172.7444883|-26.8359977|9.8357631|89.9537882 unknown
InChI: InChI=1S/C10H10Cl3NO/c1-14-4-5-2-6-9(13)7(11)3-8(12)10(6)15-5/h3,5,14H,2,4H2,1H3
charge 0 multiplicity 1
25 atoms
Cl -1.226904 3.057276 0.279715
Cl -1.4466 -3.381367 -0.127522
Cl -3.883583 1.39875 1.31593
O  0.887394 -1.423903 -0.981505
N  4.031413 0.485738 -0.134743
C  1.899953 -0.295354 -1.093956
C  1.0984 1.028342 -0.924373
C  -0.214933 0.547531 -0.33541
C  2.956763 -0.514546 0.005607
C  -0.262965 -0.865037 -0.426115
C  -1.306896 1.251554 0.188028
C  -1.395853 -1.578128 -0.001171
C  -2.449204 0.535388 0.623932
C  -2.496582 -0.871873 0.528515
C  4.935526 0.600216 1.027815
H  2.347795 -0.405402 -2.096439
H  0.928831 1.539956 -1.889583
H  1.655492 1.723644 -0.274043
H  3.304735 -1.573326 -0.038371
H  2.476902 -0.372369 0.993584
H  4.551269 0.365282 -1.014282
H  -3.383432 -1.412565 0.868603
H  5.70668 1.362696 0.820925
H  5.450716 -0.350182 1.304937
H  4.360382 0.938479 1.908923
