program: Gaussian 09
title: 000036763
version: EM64L-G09RevD.01
frameworkgroup: C1[X(C12H17NO)]
method: RPBEPBE
basis: SDD
operation: Freq
keyword: #p
keyword: freq=noraman
keyword: PBEPBE/SDD
title: #p freq=noraman PBEPBE/SDD
converged: YES YES NO NO
title: Mulliken charges:
elementType: O N C C C C C C C C C C C C H H H H H H H H H H H H H H H H H
charge: -0.285352 -0.292329 -0.076422 -0.549778 0.246549 -0.408412 0.049401 0.337527 -0.413224 -0.403745 -0.319097 -0.236907 -0.793485 -0.687760 0.227051 0.232786 0.263189 0.220504 0.223403 0.238824 0.243510 0.228974 0.213698 0.183737 0.220749 0.237872 0.235316 0.214430 0.203241 0.231235 0.214512
chargesum: 0.00000
title: Mulliken charges with hydrogens summed into heavy atoms:
elementType: O N C C C C C C C C C C C C
charge: -0.285352 -0.048819 0.150630 -0.053803 0.246549 0.035495 0.049401 0.337527 -0.174400 -0.174771 0.078338 -0.016158 -0.105865 -0.038772
polarizability: 1.75552978e+02 5.12176663e-01 1.39547408e+02 -1.84012124e+01 -6.82336112e-01 9.72673070e+01
1716.lowfreq: -8.6351 -5.3940 -0.0006 -0.0006 0.0002 10.9192 25.9259 46.0066 55.9792
frequency: 25.7779 45.5608 55.8137 86.6145 102.3712 129.3441 156.5624 210.4320 219.0213 247.2368 255.5821 287.9216 319.5367 414.4524 460.0448 463.1313 493.7137 505.2056 539.7721 583.7869 632.4010 684.6213 724.5755 737.9948 767.2595 806.8199 812.5844 854.4723 887.5139 894.1423 907.6952 928.1775 952.6813 958.1056 1020.7158 1035.4960 1043.6470 1046.5260 1073.7424 1077.9847 1106.2869 1115.6445 1146.9264 1151.6511 1176.8375 1196.6309 1215.2976 1240.2709 1262.2323 1272.1546 1279.0653 1283.9963 1319.8297 1342.2429 1379.7945 1390.8522 1393.8628 1402.5754 1428.2635 1451.2484 1460.5577 1465.3955 1471.9187 1472.1783 1479.1672 1483.9462 1484.5059 1498.2703 1605.9509 1625.8587 2865.9386 2901.1202 2978.0087 2978.8409 2994.0000 3002.9208 3014.9703 3041.6620 3054.7323 3061.2498 3071.7089 3087.5208 3092.8794 3119.9730 3132.9739 3157.6021 3416.6016
redmass: 3.9350 2.4897 2.1892 1.0548 2.5145 3.1556 2.8358 3.3334 3.1523 1.1593 3.5778 2.6865 4.5139 2.7789 2.7748 3.2838 3.4721 4.9468 3.6488 5.3377 4.6846 1.3857 4.3712 6.0143 1.2196 1.1701 3.9314 2.8017 1.4412 1.9377 2.0356 2.1557 1.8795 1.3903 2.6096 3.2749 1.5400 1.6250 1.7052 1.8511 1.4250 1.6601 3.0256 2.3031 1.4277 1.7797 1.4272 1.3529 1.2679 2.0981 1.7350 1.4432 1.3525 1.3899 1.3867 1.3998 2.1117 1.7977 2.3910 1.1711 1.0461 1.3956 1.5766 1.0893 1.0678 1.3321 1.0915 1.0849 6.8672 8.3534 1.0718 1.0689 1.0367 1.0374 1.0643 1.0872 1.0889 1.0895 1.0971 1.0996 1.0979 1.0997 1.1003 1.0866 1.0914 1.0988 1.0738
irintensity: 0.1212 0.6052 0.7398 0.3826 0.8722 2.5071 3.7518 6.1152 0.7672 0.3910 6.0549 4.3873 2.0965 1.6685 1.1954 1.5875 0.2918 5.1337 0.6612 2.5754 3.1539 80.9518 7.1219 6.9209 64.0188 2.4066 16.5948 16.7254 4.7866 7.7892 22.5426 16.7418 17.1266 4.4415 1.1628 0.5037 17.5922 12.1967 21.1394 8.9512 24.4467 19.5284 107.3682 25.9547 10.3372 7.9712 6.8924 0.4818 7.6196 20.1360 32.0595 8.1145 15.6958 3.6944 3.7680 19.0064 5.9651 18.4729 47.6779 22.9167 13.4374 6.8775 37.3337 14.1614 5.6536 23.3572 3.2808 5.5374 14.9139 2.2481 109.8281 82.7610 35.7894 29.6666 20.6110 24.3763 5.2794 62.2288 19.4395 18.8167 52.4593 22.1213 38.2896 5.8434 19.3750 31.1160 1.8159
temp: 298.150 k
press: 1.00000 atm
elementType: 8 7 6 6 6 6 6 6 6 6 6 6 6 6 1 1 1 1 1 1 1 1 1 1 1 1 1 1 1 1 1
symmnumber: 1
zpe: 693984.5 jmol-1
zpe.correction: 0.264325 hartree
zpe.thermalcorrener: 0.278575 hartree
zpe.thermalcorrenthalpy: 0.279520 hartree
zpe.thermalcorrgfe: 0.221858 hartree
zpe.sumelectzpe: -596.376407 hartree
zpe.sumelectthermal: -596.362156 hartree
zpe.sumelectthermalent: -596.361212 hartree
zpe.sumelectthermalfe: -596.418873 hartree
dipole: -2.0464 -0.0468 -0.0123
dipole: 2.0470
quadrupole: -76.2507 -83.1979 -84.0463
quadrupole: 2.1407 -3.1721 0.3084
quadrupole: 4.9143 -2.0329 -2.8814 2.1407 -3.1721 0.3084
hfenergy: -596.6407316 hartree
pointgroup: C01 [X(C12H17N1O1)]
dipole: 0.8052834 0.0084668 -0.0060922 debye
polarizability: 174.972186|3.8411128|138.4063005|-19.2231828|6.8161043|98.9892067 unknown
InChI: InChI=1S/C12H17NO/c1-3-13-8-11-7-10-6-4-5-9(2)12(10)14-11/h4-6,11,13H,3,7-8H2,1-2H3
charge 0 multiplicity 1
31 atoms
O  -0.301732 -1.171713 -0.974273
N  3.240864 -0.048196 -0.30962
C  0.922498 -0.299816 -1.141534
C  0.448442 1.168913 -0.92988
C  -0.911191 0.990966 -0.26773
C  1.963812 -0.762433 -0.103559
C  -1.284266 -0.368159 -0.353777
C  -2.514715 -0.876448 0.114434
C  -1.790754 1.915665 0.322595
C  -3.38493 0.07852 0.704914
C  4.240237 -0.235191 0.768472
C  -3.036699 1.447286 0.813671
C  -2.861075 -2.344903 -0.012602
C  5.539773 0.522441 0.447445
H  1.288547 -0.491125 -2.16621
H  0.352796 1.707248 -1.891762
H  1.18685 1.712588 -0.315331
H  2.05108 -1.873561 -0.159948
H  1.588085 -0.517843 0.909119
H  -1.524226 2.975746 0.39928
H  3.649367 -0.264974 -1.231065
H  -4.353646 -0.264433 1.088558
H  3.802033 0.157478 1.706881
H  4.473851 -1.31389 0.953064
H  -3.737795 2.148241 1.279581
H  -2.848912 -2.668495 -1.070076
H  -2.122965 -2.976523 0.516409
H  -3.861012 -2.555824 0.403609
H  6.00804 0.137218 -0.478988
H  5.333409 1.597703 0.30541
H  6.272931 0.407913 1.265916
