program: Gaussian 09
title: 000036773
version: EM64L-G09RevD.01
frameworkgroup: C1[X(C11H12Cl3NO)]
method: RPBEPBE
basis: SDD
operation: Freq
keyword: #p
keyword: freq=noraman
keyword: PBEPBE/SDD
title: #p freq=noraman PBEPBE/SDD
converged: YES YES NO NO
title: Mulliken charges:
elementType: Cl Cl Cl O N C C C C C C C C C C C H H H H H H H H H H H H
charge: 0.003451 -0.013377 -0.012877 -0.250593 -0.298077 -0.076176 -0.535371 -0.403252 0.406625 0.374275 -0.337305 -0.330203 -0.322334 -0.112723 -0.231801 -0.684687 0.241231 0.256806 0.286172 0.230478 0.221735 0.248851 0.215759 0.188850 0.280696 0.204378 0.232136 0.217332
chargesum: 0.00000
title: Mulliken charges with hydrogens summed into heavy atoms:
elementType: Cl Cl Cl O N C C C C C C C C C C C
charge: 0.003451 -0.013377 -0.012877 -0.250593 -0.049226 0.165055 0.007606 0.048961 0.406625 0.374275 -0.337305 -0.330203 0.082276 -0.112723 0.048895 -0.030840
polarizability: 1.95641961e+02 4.02150666e+00 1.84686394e+02 1.94915491e+01 -3.85993473e+00 9.55451558e+01
1716.lowfreq: -12.0964 -3.3464 -0.0032 -0.0027 -0.0022 2.9997 19.7235 40.7868 46.4241
frequency: 19.0451 40.7744 46.1499 69.7500 95.0262 114.5507 135.6948 155.1810 169.5163 183.5323 202.0565 247.9627 251.5490 284.4198 296.6418 313.6383 351.1693 368.5698 435.6992 464.6766 481.9509 503.8492 533.9546 599.1065 624.9226 674.8936 704.0518 706.8515 736.0579 808.2677 845.9867 850.6053 882.8206 889.8216 900.2966 911.6707 942.5379 1035.7575 1043.8352 1077.0060 1103.5046 1112.6987 1117.5970 1148.6448 1165.2762 1199.0377 1220.3613 1230.2410 1256.2682 1274.7650 1280.8412 1320.8342 1342.1632 1350.8749 1380.7697 1391.8490 1413.3013 1423.1956 1449.7621 1465.0172 1472.2410 1479.4351 1483.9382 1498.2012 1572.7877 1603.5880 2877.7614 2912.0829 2980.5275 3006.9507 3007.1517 3017.2327 3058.4846 3073.7114 3074.1755 3095.8691 3182.1228 3423.5801
redmass: 5.0126 4.8576 1.9934 8.0756 3.3957 3.6763 6.5515 3.4678 8.2699 15.6270 6.6425 1.3924 2.8392 3.6342 4.6270 18.6161 10.4959 9.5618 2.4527 4.0300 5.3376 3.8917 6.0274 10.9230 6.1933 1.4323 5.3539 5.3044 9.9653 1.1116 3.3169 1.4085 3.7906 1.7983 3.8859 3.7745 2.4050 3.2393 1.6454 1.8202 1.4409 2.7150 1.9330 3.1487 2.0143 1.8434 1.4510 2.8020 1.3611 1.2593 1.4399 1.3587 1.4145 8.1407 1.3421 1.3067 4.2391 7.7847 1.1817 1.0992 1.0570 1.0674 1.0731 1.0845 8.8132 11.2667 1.0713 1.0682 1.0376 1.0793 1.0720 1.0908 1.0898 1.0978 1.0994 1.1004 1.0927 1.0739
irintensity: 0.0088 0.2173 0.8744 0.0490 1.2069 1.2950 0.6338 1.6880 1.7373 0.8689 3.9341 0.2529 2.0299 2.5874 6.5593 0.1383 2.7797 2.5402 1.1702 8.2639 4.7370 1.1509 17.4663 0.5393 5.9011 85.8287 20.6843 12.3230 42.0522 8.8820 22.7334 18.6830 28.7172 1.6962 9.7701 14.6259 56.8217 1.5397 23.1957 3.8110 53.3900 84.3143 9.2270 89.2103 39.6354 2.8405 0.6944 28.8138 24.1282 16.0294 14.6647 16.4469 7.1143 56.4811 6.0458 27.9868 191.0535 15.0116 20.3021 23.0494 16.3485 6.5822 1.3951 6.6974 4.2588 13.1217 107.1788 71.8862 29.9298 15.3955 16.2290 12.4414 37.2127 45.7109 19.2483 37.0226 1.0639 0.8762
temp: 298.150 k
press: 1.00000 atm
elementType: 17 17 17 8 7 6 6 6 6 6 6 6 6 6 6 6 1 1 1 1 1 1 1 1 1 1 1 1
symmnumber: 1
zpe: 547092.3 jmol-1
zpe.correction: 0.208376 hartree
zpe.thermalcorrener: 0.224848 hartree
zpe.thermalcorrenthalpy: 0.225792 hartree
zpe.thermalcorrgfe: 0.161658 hartree
zpe.sumelectzpe: -1935.307058 hartree
zpe.sumelectthermal: -1935.290586 hartree
zpe.sumelectthermalent: -1935.289642 hartree
zpe.sumelectthermalfe: -1935.353777 hartree
dipole: 4.2867 0.0323 0.3364
dipole: 4.3000
quadrupole: -102.4667 -125.6991 -112.2959
quadrupole: -1.2569 1.5856 -0.5404
quadrupole: 11.0206 -12.2119 1.1913 -1.2569 1.5856 -0.5404
hfenergy: -1935.5154343 hartree
pointgroup: C01 [X(C11H12Cl3N1O1)]
dipole: 1.6659788 -0.0353508 -0.2920304 debye
polarizability: 191.0170405|0.3359297|183.2784228|-28.5308671|12.467273|101.5780474 unknown
InChI: InChI=1S/C11H12Cl3NO/c1-2-15-5-6-3-7-10(14)8(12)4-9(13)11(7)16-6/h4,6,15H,2-3,5H2,1H3
charge 0 multiplicity 1
28 atoms
Cl -1.283971 3.094216 0.288169
Cl -2.153147 -3.293332 -0.051338
Cl -4.038517 1.708069 1.460597
O  0.321817 -1.578906 -1.027931
N  3.664566 0.034305 -0.324576
C  1.434007 -0.555565 -1.19599
C  0.774872 0.840837 -1.00189
C  2.514268 -0.872402 -0.14357
C  -0.550772 0.494195 -0.349411
C  -0.741175 -0.907388 -0.425307
C  -1.54327 1.304354 0.217058
C  -1.917496 -1.503659 0.057665
C  4.621084 0.078933 0.807836
C  -2.728442 0.705796 0.711664
C  -2.917398 -0.690324 0.631506
C  5.769219 1.058258 0.513034
H  1.822332 -0.71317 -2.216613
H  0.611612 1.362578 -1.962721
H  1.427494 1.480559 -0.383945
H  2.766616 -1.956559 -0.20601
H  2.089876 -0.69707 0.864294
H  4.153473 -0.140512 -1.214698
H  4.065654 0.415956 1.70461
H  5.041304 -0.928045 1.051485
H  -3.835778 -1.139589 1.017371
H  6.353622 0.73729 -0.37086
H  5.371763 2.068537 0.312911
H  6.463587 1.114739 1.370162
