program: Gaussian 09
title: 000036769
version: EM64L-G09RevD.01
frameworkgroup: C1[X(C12H17NO)]
method: RPBEPBE
basis: SDD
operation: Freq
keyword: #p
keyword: freq=noraman
keyword: PBEPBE/SDD
title: #p freq=noraman PBEPBE/SDD
converged: YES YES NO NO
title: Mulliken charges:
elementType: O N C C C C C C C C C C C C H H H H H H H H H H H H H H H H H
charge: -0.279076 -0.293627 -0.079752 -0.552503 0.245606 -0.405946 0.176339 -0.527577 -0.360890 0.459857 -0.405774 -0.318462 -0.818078 -0.687251 0.227222 0.232674 0.263982 0.221647 0.223137 0.240844 0.243644 0.245006 0.213265 0.184275 0.228715 0.226937 0.222178 0.225105 0.203376 0.230862 0.214265
chargesum: 0.00000
title: Mulliken charges with hydrogens summed into heavy atoms:
elementType: O N C C C C C C C C C C C C
charge: -0.279076 -0.049983 0.147470 -0.055847 0.245606 0.038838 0.176339 -0.286733 -0.115884 0.459857 -0.177059 0.079078 -0.143857 -0.038748
polarizability: 1.84805164e+02 9.13556534e+00 1.30383420e+02 -1.67641406e+01 9.81233773e+00 1.00828573e+02
1716.lowfreq: -16.4476 -3.2076 -0.0007 -0.0006 -0.0005 5.8121 24.3182 42.5915 43.8248
frequency: 24.0856 41.7032 43.8055 63.3423 101.1580 135.6068 152.5928 182.6591 246.2652 256.8492 281.9232 301.4604 340.4991 399.0003 416.7643 445.2414 461.8614 491.2166 550.4237 600.1535 677.1549 701.4738 714.1956 736.0192 778.2371 807.4179 813.1301 854.0382 878.6350 893.6201 902.7899 917.9947 935.9508 945.1189 996.5960 1035.4058 1044.1203 1047.4565 1076.1549 1091.8325 1106.8965 1115.5660 1135.0297 1146.7803 1185.6437 1200.3202 1219.5978 1242.6853 1254.3113 1266.9209 1279.1428 1289.9134 1317.9446 1341.2939 1375.2509 1381.7250 1392.4876 1398.4751 1438.5010 1447.2349 1463.1590 1470.9734 1472.1634 1478.9805 1479.7175 1480.0221 1484.1833 1498.2550 1609.8114 1625.0444 2866.5388 2902.8566 2970.6257 2979.3174 2993.4312 3003.7319 3013.8265 3042.5159 3046.1615 3062.3554 3071.9242 3078.9316 3093.0313 3119.5078 3126.8215 3168.3410 3415.5299
redmass: 3.8471 1.6318 1.1659 2.6429 2.8683 2.9845 3.8175 2.7006 1.1422 3.3002 3.4106 2.9805 4.9446 3.0829 2.7917 3.0519 3.0703 4.0462 3.1809 5.4426 1.4943 4.3777 3.5691 4.5263 6.0021 1.1043 1.3733 2.7311 1.4430 1.9617 1.8755 2.9992 1.5773 1.7865 1.4524 3.2832 1.5994 1.5597 1.8886 2.7389 1.4494 1.6773 1.4026 3.1464 1.4307 1.8443 1.5157 1.7669 1.7844 1.4080 1.4373 1.4293 1.3524 1.4098 3.2793 1.5252 1.3097 1.2604 4.6806 1.1853 1.2517 1.0470 1.0553 1.7430 1.1811 1.1446 1.0815 1.0852 7.1487 7.4269 1.0717 1.0687 1.0373 1.0373 1.0645 1.0872 1.0892 1.0894 1.0977 1.0992 1.0979 1.0983 1.1002 1.0919 1.0897 1.0953 1.0738
irintensity: 0.2522 1.2220 0.1390 1.0705 0.1196 3.5747 0.3871 4.8817 0.6972 4.4239 0.7706 5.5284 2.9896 3.5878 6.3269 2.2671 1.7175 5.2893 2.3376 1.9706 68.3532 21.0483 1.8991 9.7157 5.5571 7.5512 50.0478 14.7700 12.9822 4.0936 13.9348 5.8141 11.6500 24.1353 2.8568 0.9174 7.7797 28.4332 5.8473 46.7883 10.0310 14.4928 4.8804 84.4976 17.5887 12.1984 34.0403 70.9718 3.4391 7.9148 5.7458 6.2688 16.2367 3.8055 3.1727 3.3957 26.5192 5.7184 1.0868 32.9761 21.1973 12.8071 15.4570 102.4101 15.5454 12.4770 3.2948 5.4569 0.2833 8.9468 113.9358 83.1094 52.9537 31.4846 20.5326 24.3262 6.0046 64.1022 25.4379 17.0658 52.3919 20.2876 39.1214 16.8917 18.7622 9.6924 1.8199
temp: 298.150 k
press: 1.00000 atm
elementType: 8 7 6 6 6 6 6 6 6 6 6 6 6 6 1 1 1 1 1 1 1 1 1 1 1 1 1 1 1 1 1
symmnumber: 1
zpe: 693459.8 jmol-1
zpe.correction: 0.264125 hartree
zpe.thermalcorrener: 0.278444 hartree
zpe.thermalcorrenthalpy: 0.279388 hartree
zpe.thermalcorrgfe: 0.221065 hartree
zpe.sumelectzpe: -596.374903 hartree
zpe.sumelectthermal: -596.360585 hartree
zpe.sumelectthermalent: -596.359641 hartree
zpe.sumelectthermalfe: -596.417964 hartree
dipole: -1.6908 1.1365 0.1547
dipole: 2.0432
quadrupole: -72.9903 -85.8036 -83.6596
quadrupole: 3.9790 -2.1540 0.5384
quadrupole: 7.8276 -4.9858 -2.8418 3.9790 -2.1540 0.5384
hfenergy: -596.6390283 hartree
pointgroup: C01 [X(C12H17N1O1)]
dipole: 0.6652264 0.4385031 0.1065747 debye
polarizability: 184.5161864|-2.0399505|133.0350511|-19.6392094|3.2353328|98.4659189 unknown
InChI: InChI=1S/C12H17NO/c1-3-13-8-11-7-10-6-9(2)4-5-12(10)14-11/h4-6,11,13H,3,7-8H2,1-2H3
charge 0 multiplicity 1
31 atoms
O  0.099336 -1.652014 -1.047544
N  3.351975 0.102709 -0.269932
C  1.181339 -0.610392 -1.224553
C  0.468413 0.773869 -1.188787
C  -0.884151 0.436947 -0.575833
C  2.198846 -0.80183 -0.082506
C  -1.0311 -0.97008 -0.550118
C  -1.929724 1.252941 -0.117043
C  -2.199166 -1.592746 -0.085521
C  -3.133016 0.663146 0.369428
C  -3.245493 -0.751392 0.372985
C  4.279611 0.181619 0.882843
C  -4.273199 1.537869 0.866568
C  5.447356 1.13589 0.581033
H  1.65038 -0.829124 -2.200477
H  0.348228 1.194881 -2.205021
H  1.071992 1.486738 -0.600613
H  2.472173 -1.882325 -0.029356
H  1.70677 -0.544859 0.875987
H  -1.828645 2.345473 -0.13319
H  3.863328 -0.111768 -1.139101
H  -2.293523 -2.682327 -0.075718
H  3.706103 0.55859 1.75217
H  4.682422 -0.819915 1.177307
H  -4.169012 -1.210845 0.745569
H  -4.674844 2.179213 0.058576
H  -5.108347 0.928471 1.253379
H  -3.944173 2.210824 1.681024
H  6.048803 0.774219 -0.275433
H  5.067085 2.141928 0.331536
H  6.121434 1.217992 1.452443
