program: Gaussian 09
title: 000036751
version: EM64L-G09RevD.01
frameworkgroup: C1[X(C16H13Br)]
method: RPBEPBE
basis: SDD
operation: Freq
keyword: #p
keyword: freq=noraman
keyword: PBEPBE/SDD
title: #p freq=noraman PBEPBE/SDD
converged: NO NO NO NO
title: Mulliken charges:
elementType: Br C C C C C C C C C C C C C C C C H H H H H H H H H H H H H
charge: -0.066715 0.278850 0.278869 0.310324 0.310330 0.129431 -0.040387 -0.386021 -0.386050 -0.410699 -0.410766 -0.927880 -0.817678 -0.266687 -0.266625 -0.265743 -0.265832 0.250362 0.250427 0.235784 0.235624 0.295290 0.295340 0.245394 0.233899 0.233870 0.232871 0.232871 0.230770 0.230774
chargesum: 0.00000
title: Mulliken charges with hydrogens summed into heavy atoms:
elementType: Br C C C C C C C C C C C C C C C C
charge: -0.066715 0.278850 0.278869 0.310324 0.310330 0.129431 -0.040387 -0.135659 -0.135623 -0.174915 -0.175142 -0.337249 -0.104515 -0.033815 -0.033754 -0.034974 -0.035058
polarizability: 2.48382381e+02 1.62932612e-02 2.94169850e+02 8.17048115e+00 -2.22713676e-03 9.44177200e+01
1716.lowfreq: -86.0053 -12.8442 -2.8309 -2.3265 -0.0006 -0.0005 -0.0003 42.3499 47.0595
frequency: -85.9904 42.2624 47.0594 82.0971 102.7023 139.8700 156.5120 235.6349 268.1767 341.4017 361.7008 378.1223 379.7464 400.7023 425.7212 475.5070 486.4609 496.3834 503.6157 577.1480 582.2236 602.2031 603.4029 656.8362 666.5440 757.8140 762.9118 764.8302 773.9749 796.6141 819.0957 867.9517 868.7555 912.7628 934.5467 961.9287 962.3893 990.6007 990.6157 1022.3813 1026.2070 1035.2530 1039.3552 1071.1023 1080.2372 1109.7045 1120.7922 1181.7449 1184.5983 1189.3112 1197.0428 1246.1265 1287.5161 1303.7975 1338.5800 1374.8520 1382.1141 1393.1070 1396.1970 1440.7998 1441.2655 1452.2200 1463.0046 1472.7260 1499.0276 1519.2513 1540.7004 1554.3208 1565.9405 1619.4496 1631.5362 2979.2886 3073.3207 3095.2820 3105.9451 3131.4921 3131.6110 3145.5650 3146.2545 3160.7751 3162.4245 3169.8174 3172.8545 3172.8829
redmass: 1.0934 8.4792 5.0100 6.3416 3.6104 3.3858 5.8071 4.4782 4.6753 5.4714 2.8227 4.6549 2.3894 4.0998 5.4342 2.7272 5.5901 4.5431 3.4315 3.5631 4.8535 6.4299 3.1215 3.3243 5.2679 3.0451 3.5899 1.3948 1.7803 2.1767 1.5953 1.8222 2.4077 3.0364 2.2115 1.3639 1.3659 1.3477 1.3418 2.1182 4.9653 2.2344 1.8925 1.6723 4.9866 2.5170 1.2433 1.1231 1.3960 1.0991 1.1574 1.3548 1.5792 2.9710 4.6656 5.1648 1.5505 1.2110 5.3961 7.2392 2.5775 1.9120 1.1905 1.5587 1.1915 1.4655 5.9684 5.9066 7.3297 5.8086 5.7936 1.0462 1.0871 1.0583 1.0985 1.0853 1.0854 1.0891 1.0888 1.0969 1.0944 1.1042 1.0991 1.1014
irintensity: 0.5652 0.2933 0.5302 1.4742 0.0007 1.7447 4.3043 0.1938 0.0125 19.2832 0.2251 4.7931 0.7256 11.3437 0.0472 0.5877 71.4156 34.6507 0.0360 0.0073 18.4574 5.4127 3.6384 12.0275 4.2865 0.1354 64.5610 0.1730 127.7600 8.3335 1.2131 0.0011 0.2196 0.7040 3.4725 0.9533 0.0999 0.1751 0.0122 8.8756 1.9535 6.6423 4.7376 1.0474 28.6838 0.0047 1.8431 1.6776 14.2347 1.3558 93.6211 0.1002 0.4666 37.6211 5.7659 0.2640 0.2266 10.6322 0.3804 2.6429 14.7900 22.0971 0.8704 24.1857 8.7143 17.9351 9.5290 1.6859 24.1203 4.3563 1.9445 26.8647 22.2810 15.0251 11.2894 4.4026 0.0625 13.3396 0.3809 2.7308 47.1152 11.6711 4.8612 51.0736
temp: 298.150 k
press: 1.00000 atm
elementType: 35 6 6 6 6 6 6 6 6 6 6 6 6 6 6 6 6 1 1 1 1 1 1 1 1 1 1 1 1 1
symmnumber: 1
zpe: 622085.7 jmol-1
zpe.correction: 0.236940 hartree
zpe.thermalcorrener: 0.250372 hartree
zpe.thermalcorrenthalpy: 0.251316 hartree
zpe.thermalcorrgfe: 0.195374 hartree
zpe.sumelectzpe: -629.816092 hartree
zpe.sumelectthermal: -629.802661 hartree
zpe.sumelectthermalent: -629.801716 hartree
zpe.sumelectthermalfe: -629.857658 hartree
dipole: -3.4609 -0.0004 1.0577
dipole: 3.6189
quadrupole: -104.1637 -93.0863 -112.7380
quadrupole: 0.0001 7.6361 -0.0005
quadrupole: -0.8344 10.2430 -9.4086 0.0001 7.6361 -0.0005
hfenergy: -630.0530323 hartree
pointgroup: C01 [X(C16H13Br1)]
dipole: -0.0002243 -1.313473 -0.5494902 debye
polarizability: 294.1698509|0.0137882|248.4766895|0.0047605|7.2268589|94.3234102 unknown
InChI: InChI=1S/C16H13Br/c1-11-12-6-2-4-8-14(12)16(10-17)15-9-5-3-7-13(11)15/h2-9H,10H2,1H3
charge 0 multiplicity 1
30 atoms
Br 0.000259 3.920921 0.953525
C  -1.237926 0.49762 -0.186874
C  1.237981 0.497544 -0.186911
C  -1.235555 -0.952009 0.005215
C  1.235502 -0.9521 0.00519
C  0.000027 1.201133 -0.346207
C  -0.000035 -1.673278 0.052348
C  -2.507023 1.184154 -0.196528
C  2.507181 1.183929 -0.196456
C  -2.508221 -1.619619 0.156811
C  2.508092 -1.619859 0.156697
C  -0.000097 2.645873 -0.706759
C  -0.000091 -3.188319 0.183213
C  -3.708414 0.501303 -0.043872
C  3.708498 0.500942 -0.043823
C  -3.710051 -0.922077 0.130777
C  3.709994 -0.922453 0.13069
H  -2.527043 2.274362 -0.282705
H  2.527376 2.274136 -0.282486
H  -2.528484 -2.700743 0.31808
H  2.528236 -2.701005 0.317878
H  -0.897633 2.970367 -1.246148
H  0.897087 2.970466 -1.246648
H  -0.001695 -3.502738 1.246107
H  -0.883047 -3.640079 -0.294892
H  0.88436 -3.639983 -0.292177
H  -4.656005 1.05079 -0.040963
H  4.656146 1.050331 -0.040837
H  -4.659419 -1.453557 0.257292
H  4.659298 -1.454053 0.257162
