program: Gaussian 09
title: 000036730
version: EM64L-G09RevD.01
frameworkgroup: C1[X(C16H9Cl)]
method: RPBEPBE
basis: SDD
operation: Freq
keyword: #pfreq=noraman
keyword: PBEPBE/SDD
title: #p freq=noraman PBEPBE/SDD
converged: NO NO NO YES
title: Mulliken charges:
elementType: Cl C C C C C C C C C C C C C C C C H H H H H H H H H
charge: -0.049751 0.016647 0.004363 0.579418 0.494295 0.479929 0.473133 -0.459928 -0.485170 -0.474568 -0.480779 -0.391620 -0.477759 -0.463197 -0.462250 -0.258595 -0.239226 0.258690 0.240723 0.239179 0.238789 0.246580 0.244504 0.243000 0.254766 0.228830
chargesum: 0.00000
title: Mulliken charges with hydrogens summed into heavy atoms:
elementType: Cl C C C C C C C C C C C C C C C C
charge: -0.049751 0.016647 0.004363 0.579418 0.494295 0.479929 0.473133 -0.201238 -0.244447 -0.235390 -0.241991 -0.391620 -0.231179 -0.218693 -0.219250 -0.003829 -0.010396
polarizability: 3.03048714e+02 -1.59567909e+01 2.15782437e+02 4.33140016e-04 1.53432020e-04 6.65250688e+01
1716.lowfreq: -11.8854 -5.7737 -0.0010 0.0017 0.0020 7.7223 73.5507 109.6447 184.3251
frequency: 73.5355 109.6438 184.3249 186.7206 218.1598 263.2608 295.1481 317.9169 396.4473 407.8512 416.6890 466.4349 493.2507 505.4532 511.5613 523.4130 548.8810 567.7405 594.9781 621.6187 686.0709 692.8344 732.1833 745.1251 770.0742 804.7845 808.3291 815.1002 840.9897 851.1943 877.4372 918.1770 953.3715 964.3558 979.6005 989.6674 994.3882 1005.7852 1080.1604 1110.2844 1142.5239 1153.3953 1174.0927 1187.8717 1205.2596 1231.5529 1250.9762 1256.8638 1325.8548 1371.5876 1384.6792 1406.7523 1425.8155 1428.6832 1429.9872 1459.3039 1488.4133 1495.7219 1551.1172 1593.1997 1598.8700 1607.7239 1635.9944 3121.2691 3123.7417 3129.2389 3133.3639 3137.0292 3146.1383 3157.2630 3164.8415 3170.1063
redmass: 7.4342 4.7236 4.5181 11.9719 3.9097 4.5599 4.4781 12.3141 5.1066 7.7423 3.6349 6.1898 3.6955 5.7087 3.7533 4.8653 3.1120 6.9443 3.8562 7.3291 7.0586 3.6477 2.7332 5.4778 1.2579 1.4312 4.9106 6.2806 2.1510 2.1669 1.7956 1.4525 1.3766 4.4484 1.3483 1.3807 1.3840 7.7990 2.0542 2.2061 1.8359 1.3684 1.3344 1.3156 1.5126 1.8765 1.6841 2.1045 2.9226 3.6314 2.6228 2.6577 4.0609 6.4299 2.1862 4.8899 5.7511 3.6926 5.0601 8.3796 6.2483 6.5163 7.5097 1.0862 1.0861 1.0886 1.0916 1.0896 1.0982 1.0991 1.0957 1.0956
irintensity: 0.0142 0.6695 1.0847 0.4152 11.8566 0.0037 0.1375 3.2225 3.2532 1.6578 0.1464 2.2568 2.2133 1.7888 0.7438 3.8852 1.3525 3.9070 4.1027 8.0176 0.1408 3.6382 27.7828 5.6048 15.7939 2.6449 15.9465 19.6950 0.9293 4.5402 158.4325 0.0047 1.6215 4.1940 2.5305 0.0070 1.0358 29.5798 22.0435 1.0135 17.3728 2.4640 5.6281 12.3522 10.3536 1.5480 6.7842 1.9744 3.6636 15.3998 0.6183 4.3541 2.3966 0.5121 21.5089 10.0682 22.9304 1.6627 2.6248 8.7272 5.0038 8.6143 1.2631 1.2246 0.2023 4.4202 18.0832 4.2415 34.5470 38.7507 11.6711 6.4126
temp: 298.150 k
press: 1.00000 atm
elementType: 17 6 6 6 6 6 6 6 6 6 6 6 6 6 6 6 6 1 1 1 1 1 1 1 1 1
symmnumber: 1
zpe: 510878.3 jmol-1
zpe.correction: 0.194583 hartree
zpe.thermalcorrener: 0.206119 hartree
zpe.thermalcorrenthalpy: 0.207063 hartree
zpe.thermalcorrgfe: 0.157034 hartree
zpe.sumelectzpe: -1074.096196 hartree
zpe.sumelectthermal: -1074.084660 hartree
zpe.sumelectthermalent: -1074.083716 hartree
zpe.sumelectthermalfe: -1074.133745 hartree
dipole: 2.0485 0.9520 0.0000
dipole: 2.2589
quadrupole: -96.9039 -88.1250 -111.1922
quadrupole: -4.1852 0.0000 0.0001
quadrupole: 1.8365 10.6153 -12.4519 -4.1852 0.0000 0.0001
hfenergy: -1074.2907794 hartree
pointgroup: C01 [X(C16H9Cl1)]
dipole: 0.744108 0.4858958 0.0000091 debye
dipolederiv: -0.6468928 -0.3107083 -0.000002 -0.5394045 -0.403264 -0.0000026 -0.0000006 -0.0000011 -0.0632083 0.0686181 -0.023545 0. 0.0467489 -0.0298358 0.0000002 -0.0000003 0.0000022 -0.0462539 -0.0171597 -0.0321217 0. -0.031394 -0.0954618 -0.0000005 -0.0000002 -0.0000007 -0.0328519 -0.2728646 -0.2272355 -0.0000011 -0.2889874 -0.0689209 -0.0000021 0.0000017 -0.0000031 0.1027639 0.0314633 0.1022897 0.0000001 0.1061538 -0.1153361 0.0000002 0.0000016 -0.0000002 0.084554 0.0626676 0.1165415 -0.0000003 0.0889718 -0.0928906 -0.0000003 -0.0000001 -0.0000013 0.0787932 -0.0572054 -0.1376568 -0.0000006 -0.1280364 0.0244664 -0.0000011 -0.000002 -0.0000024 0.0799643 -0.0428519 0.0968311 0.0000008 -0.0404264 0.0331308 0.0000007 0.0000019 0.0000016 -0.1657549 0.0163595 -0.0232136 -0.0000008 0.0653157 0.1475581 0.0000021 -0.0000026 0.0000038 -0.1784206 0.0387726 -0.0528359 0. 0.0585175 0.1642583 -0.0000006 -0.0000017 0.0000003 -0.1669042 0.0138291 0.0814619 0.0000016 0.0039282 0.1077996 0.0000016 0.000003 0.0000022 -0.1777512 0.8344477 0.5230821 0.0000042 0.7936453 0.5337326 0.0000045 0.0000026 0.0000028 -0.1161037 -0.0087438 0.0015929 0.0000011 0.0082159 0.0888929 -0.0000014 0.0000052 -0.0000042 -0.1939054 -0.1322341 -0.0500724 -0.0000002 -0.0210344 0.0931794 0.0000025 -0.0000028 0.0000048 -0.190694 -0.0697379 0.1143552 0.0000027 0.1021518 0.0235067 0.0000026 0.0000071 0.0000041 -0.1910528 -0.0624556 -0.1292115 -0.0000041 -0.2090466 -0.1656193 0.0000003 -0.0000094 0.0000026 -0.0944953 0.1966414 -0.047348 0.000001 -0.0567322 -0.0196723 -0.0000006 0.0000008 -0.0000011 -0.1473309 0.0385524 -0.1013626 -0.0000007 -0.0296847 0.0188021 -0.0000003 -0.0000016 -0.0000011 0.15877 0.0566427 0.0972701 0.0000005 0.017165 -0.0951 -0.0000012 0.0000006 -0.0000025 0.1549079 0.0467084 0.0902352 0. 0.0236249 -0.0897906 0. 0.0000003 -0.0000004 0.1504973 -0.0222139 -0.1342741 -0.0000011 -0.0575883 -0.0199257 -0.0000008 -0.0000016 -0.000002 0.1545148 0.0635189 0.0070801 -0.0000002 0.0595336 -0.094447 0.0000007 -0.0000011 0.0000019 0.1591019 0.0732561 0.0171404 0. 0.0819849 -0.0983249 -0.0000014 0.0000017 -0.0000024 0.1587915 0.0006126 -0.0685258 -0.0000017 -0.1315503 -0.030877 -0.0000019 -0.0000045 -0.0000022 0.1583851 -0.0624646 0.037384 0.0000017 0.0229816 0.1008423 -0.0000004 0.0000031 -0.0000015 0.1640345 -0.1472661 0.0528471 -0.0000011 0.0549463 0.0832966 -0.0000001 -0.000001 -0.0000002 0.1596488 unknown
polarizability: 305.7806644|-2.9577839|213.0504865|0.0004068|0.0002138|66.5250688 unknown
InChI: InChI=1S/C16H9Cl/c17-14-9-7-12-5-4-10-2-1-3-11-6-8-13(14)16(12)15(10)11/h1-9H
charge 0 multiplicity 1
26 atoms
Cl -4.10111 -1.710413 -0.000022
C  -0.45137 0.262121 -0.000011
C  0.950258 -0.060578 -0.000011
C  -1.4334 -0.801778 -0.000016
C  -0.869104 1.644327 -0.000011
C  1.379794 -1.437915 -0.00001
C  1.93618 0.994963 -0.000006
C  -0.976345 -2.174821 -0.000011
C  0.139668 2.68206 -0.000007
C  0.372665 -2.476614 -0.000009
C  1.486659 2.371019 -0.000005
C  -2.803522 -0.423887 -0.000016
C  -2.256724 1.946495 -0.000009
C  2.769954 -1.733559 -0.000008
C  3.316261 0.654523 -0.000001
C  -3.221251 0.919584 -0.00001
C  3.725821 -0.695735 -0.000002
H  -1.726291 -2.971355 -0.000015
H  -0.190396 3.727504 0.0000
H  0.70313 -3.522061 -0.000009
H  2.241706 3.165904 0.000002
H  -2.581975 2.992834 -0.000013
H  3.093562 -2.780937 -0.000015
H  4.063423 1.456808 0.000011
H  -4.289136 1.155999 0.000001
H  4.793743 -0.939691 0.000002
