program: Gaussian 09
title: 000036729
version: EM64L-G09RevD.01
frameworkgroup: C1[X(C6H10Cl3NO2)]
method: RPBEPBE
basis: SDD
operation: Freq
keyword: #p
keyword: freq=noraman
keyword: PBEPBE/SDD
title: #p freq=noraman PBEPBE/SDD
converged: YES YES NO NO
title: Mulliken charges:
elementType: Cl Cl Cl O O N C C C C C C H H H H H H H H H H
charge: 0.099154 0.136560 0.109468 -0.386009 -0.262635 -0.346569 -0.510447 -0.015535 -0.347650 0.281802 -0.614104 -0.680887 0.240861 0.208834 0.303714 0.241660 0.205427 0.322681 0.225402 0.210882 0.207788 0.369604
chargesum: 0.00000
title: Mulliken charges with hydrogens summed into heavy atoms:
elementType: Cl Cl Cl O O N C C C C C C
charge: 0.099154 0.136560 0.109468 -0.016406 -0.262635 -0.023888 -0.060752 0.288179 0.099437 0.281802 -0.614104 -0.036816
polarizability: 1.33023283e+02 -9.89548442e+00 9.52285118e+01 -5.39336344e+00 -4.21739803e+00 9.82313307e+01
1716.lowfreq: -0.3768 -0.0017 0.0011 0.0017 4.4925 13.0004 18.8609 42.6756 47.0429
frequency: 14.1751 42.6302 47.0210 57.8205 85.6464 149.9713 165.3814 178.5517 205.0334 223.4688 232.9082 240.6523 250.5208 281.2380 300.3847 347.9412 375.7333 434.4266 501.3085 542.4212 599.8500 651.0616 697.0444 744.5668 746.8078 757.6328 869.4984 887.8047 943.8929 993.6098 995.9025 1058.3668 1079.9458 1099.8410 1130.8439 1188.0868 1219.2984 1229.3949 1276.3375 1296.5909 1322.2595 1357.5569 1381.1255 1396.1396 1442.9557 1453.5165 1475.9773 1480.4530 1486.6899 1620.3210 2972.9973 2975.0725 2996.4679 3025.8690 3026.4693 3051.9024 3078.3438 3079.4801 3539.5953 3580.9883
redmass: 3.2820 8.1739 7.5234 3.0078 2.5922 4.4937 8.0062 13.0973 2.7216 2.4728 1.7825 1.2606 11.9321 10.5631 8.8541 3.6110 14.0363 4.6955 2.8866 6.3482 2.7135 1.5717 4.8198 3.1305 1.6008 8.5410 1.3516 2.1678 4.2590 5.1663 3.8388 2.5956 1.8560 2.1452 3.5132 1.8834 1.1468 1.3384 1.2214 1.1969 1.4932 1.6230 1.3055 1.2146 1.1042 1.7938 1.0496 1.0432 1.0807 6.4211 1.0565 1.0392 1.0640 1.0956 1.0863 1.0997 1.0996 1.1011 1.0778 1.0668
irintensity: 0.3509 8.1455 0.2801 0.0567 0.5429 5.3319 0.9761 1.0054 47.1236 16.0544 70.3089 10.1803 1.3358 7.1162 0.9956 0.9810 0.3856 3.2675 31.2027 36.9658 9.5434 157.0571 50.2947 191.2483 25.3146 101.6547 0.3771 6.3618 33.0828 115.0217 29.3646 2.4302 6.0573 29.8775 17.5684 92.8151 25.5247 4.5396 3.5036 24.4871 63.9874 32.0187 8.0328 9.6990 18.7371 348.9483 3.1124 13.9634 16.5770 128.0625 13.1856 33.4788 27.1081 14.6412 20.8123 0.5425 48.1850 65.8652 27.9425 23.5860
temp: 298.150 k
press: 1.00000 atm
elementType: 17 17 17 8 8 7 6 6 6 6 6 6 1 1 1 1 1 1 1 1 1 1
symmnumber: 1
zpe: 418021.8 jmol-1
zpe.correction: 0.159216 hartree
zpe.thermalcorrener: 0.174089 hartree
zpe.thermalcorrenthalpy: 0.175033 hartree
zpe.thermalcorrgfe: 0.114319 hartree
zpe.sumelectzpe: -1819.055991 hartree
zpe.sumelectthermal: -1819.041118 hartree
zpe.sumelectthermalent: -1819.040174 hartree
zpe.sumelectthermalfe: -1819.100888 hartree
dipole: 2.6342 -0.4367 1.7479
dipole: 3.1913
quadrupole: -92.9194 -89.1668 -96.2298
quadrupole: -3.9370 6.7151 1.2736
quadrupole: -0.1474 3.6052 -3.4578 -3.9370 6.7151 1.2736
hfenergy: -1819.215207 hartree
pointgroup: C01 [X(C6H10Cl3N1O2)]
dipole: 1.0415976 -0.1717246 0.6797338 debye
dipolederiv: -0.2336451 -0.0230827 0.05013 -0.0598294 -0.2341305 0.2728971 0.0679627 0.2102079 -0.6707978 -0.6617113 0.2975176 -0.1167012 0.2623407 -0.300815 0.0918691 -0.1669235 0.1194537 -0.1687134 -0.2143426 0.0930384 0.0971015 0.1045232 -0.4333705 -0.3010515 0.1066468 -0.265163 -0.4267271 -0.5688454 0.1300718 -0.1276886 0.3092291 -0.7080547 -0.2867088 -0.0322958 -0.332906 -0.4654889 -0.7445052 0.0710346 0.0078737 -0.1096024 -0.5440791 0.3060931 0.3022861 0.2315747 -0.7128928 -1.6588669 0.0410574 0.3468708 0.0213941 -0.5376226 -0.1118239 0.1796333 -0.0493851 -0.4475847 -0.3371761 0.116294 -0.0485794 0.1914914 -0.0536267 0.0782092 -0.0157989 0.0562075 0.1281907 0.9094481 -0.0607305 0.009891 -0.3640062 0.7009779 0.3769126 0.3385981 0.3450141 0.1460281 0.1713533 0.0041801 0.0069673 0.0977141 0.0690499 0.0512116 -0.050329 0.069484 0.1030526 1.614305 -0.1249208 -0.3682836 -0.0507587 0.5110075 -0.4256984 -0.7412001 -0.3470181 0.8335251 1.0268334 -0.3992548 -0.0749061 -0.295533 0.9800869 -0.0914856 -0.0058054 -0.0614867 1.359344 -0.0698692 0.0462149 -0.0257494 -0.0030006 0.0541768 0.010109 -0.0099648 0.0060421 0.1064422 0.0572994 0.0082838 -0.0075232 -0.0068773 -0.0385473 -0.0690221 -0.0296633 -0.0905985 0.0200122 0.0086564 -0.0121211 0.0537292 -0.0271662 0.0579 0.0592038 0.0435968 0.0939833 -0.1215489 0.1437523 -0.0277908 0.0473061 0.0251368 0.0292408 0.0058516 -0.1106569 -0.0508306 0.0149047 0.0746971 0.0028269 -0.0069881 -0.0198885 0.0545928 0.0613168 0.024167 0.0751474 -0.0798373 0.0206129 0.0256408 0.0131354 -0.0121128 -0.0957551 -0.1111791 0.0012184 -0.1321699 -0.0038341 0.243071 0.0488162 0.0378714 0.1066212 0.2537097 0.0659256 0.0044634 0.0855929 0.1832875 -0.1762832 -0.0777069 0.0060893 -0.1139017 0.0274753 0.0149985 0.0183304 0.0168818 0.0996271 0.0848145 -0.0074786 -0.0232102 0.0504347 -0.0887099 -0.1156157 0.007271 -0.135371 -0.0153487 0.0791359 -0.0045642 0.0472054 0.0361506 0.0439251 0.0826213 -0.0158966 0.1009838 -0.148618 0.2312657 -0.147326 0.0754588 -0.1423591 0.2525687 0.0353658 0.0843602 0.0543557 0.2669774 unknown
polarizability: 132.5718774|-10.6653542|95.3558572|-5.6101192|-3.9366739|98.5553914 unknown
InChI: InChI=1S/C6H10Cl3NO2/c1-2-3-4(11)10-5(12)6(7,8)9/h5,10,12H,2-3H2,1H3
charge 0 multiplicity 1
22 atoms
Cl -2.669147 -1.103821 1.630463
Cl -3.910652 0.617183 -0.533018
Cl -2.03946 -1.626651 -1.289399
O  -1.525582 1.688747 1.006978
O  1.259964 0.911794 -1.369582
N  0.051184 -0.032817 0.377364
C  2.418758 -0.692304 0.096809
C  -1.171201 0.666501 0.030795
C  3.757856 0.068526 -0.043688
C  1.222975 0.135479 -0.36978
C  -2.386771 -0.296113 -0.031203
C  4.970483 -0.82612 0.284311
H  2.454813 -1.602273 -0.537111
H  2.275603 -1.038819 1.13925
H  -1.013002 1.092375 -0.97993
H  3.830178 0.456876 -1.075481
H  3.749618 0.952123 0.62388
H  0.052902 -0.605985 1.224557
H  5.915736 -0.263532 0.181389
H  5.020773 -1.695496 -0.398318
H  4.920832 -1.213373 1.319673
H  -0.989758 2.500799 0.82324
