program: Gaussian 09
title: 000036737
version: EM64L-G09RevD.01
frameworkgroup: C1[X(C13H17NO3)]
method: RPBEPBE
basis: SDD
operation: Freq
keyword: #p
keyword: freq=noraman
keyword: PBEPBE/SDD
title: #p freq=noraman PBEPBE/SDD
converged: YES YES NO NO
title: Mulliken charges:
elementType: O O O N C C C C C C C C C C C C C H H H H H H H H H H H H H H H H H
charge: -0.287296 -0.243593 -0.260439 -0.112789 -0.403422 -0.065287 -0.336145 -0.346190 -0.325282 -0.321062 -0.316911 0.233847 0.248711 -0.370980 -0.378930 -0.227831 -0.225151 0.215581 0.220795 0.244865 0.199168 0.209303 0.214052 0.197947 0.252434 0.210513 0.192912 0.218725 0.217347 0.192542 0.247847 0.248517 0.228031 0.228173
chargesum: 0.00000
title: Mulliken charges with hydrogens summed into heavy atoms:
elementType: O O O N C C C C C C C C C C C C C
charge: -0.287296 -0.243593 -0.260439 -0.112789 0.032954 0.179578 0.072326 0.065808 0.137665 0.090574 0.092977 0.233847 0.248711 -0.123132 -0.130413 0.000200 0.003022
polarizability: 2.13651631e+02 3.31057999e+00 1.38441816e+02 -1.16709417e+01 -1.60334381e+00 1.07216754e+02
1716.lowfreq: -4.7398 -0.0009 -0.0006 0.0001 5.1293 15.8263 23.6047 34.3091 45.6123
frequency: 23.5596 34.2640 45.5566 109.7858 140.8552 146.5971 196.4724 230.8366 247.6338 287.7263 291.8647 330.5209 374.1864 394.2948 425.0517 442.4997 450.5094 468.7144 490.7408 512.5885 549.4171 565.9380 607.0380 652.0055 711.9845 717.1697 754.1481 766.6920 806.6067 823.5508 839.8218 846.3671 850.1154 890.1054 913.5323 931.5420 965.3093 979.4140 1001.2268 1024.6983 1027.2588 1046.8171 1052.7111 1059.5760 1082.3663 1090.1863 1107.1843 1127.9757 1140.1056 1157.0214 1160.7860 1165.3668 1191.3000 1203.5414 1228.8694 1238.5590 1264.4859 1267.5154 1278.6128 1293.6101 1305.6961 1315.7998 1332.2957 1345.9618 1357.5874 1367.6022 1372.7355 1388.9563 1391.9796 1443.2441 1444.4192 1448.6828 1452.1786 1459.5441 1460.8118 1474.1245 1474.7256 1590.3230 1612.3992 2871.4952 2878.4272 2901.0311 2954.1766 2958.0948 2982.7573 2996.7896 3028.3375 3034.7858 3036.7026 3082.9319 3086.0509 3120.4669 3136.4516 3149.7710 3162.0765 3174.4565
redmass: 4.0562 3.9980 5.1398 4.6262 3.9107 3.3857 5.7590 2.7376 2.3449 2.9511 5.0027 2.2198 3.9301 1.9541 3.2138 5.1800 3.1818 2.8054 4.9637 6.2589 4.2293 4.5902 2.1531 3.6553 4.3350 5.4701 1.2389 3.9720 4.1430 4.2961 1.6845 1.5580 2.0934 2.5507 2.1760 1.3675 1.2917 6.7744 2.6665 2.0521 2.1729 2.4329 2.3548 2.0906 2.6092 3.1884 2.3863 2.2146 2.2929 2.3145 1.0818 2.5380 1.0739 1.2325 1.6033 1.9685 1.3366 1.4529 1.3687 1.2705 1.2354 1.3202 1.2743 1.2610 1.4459 1.6359 1.3006 1.9663 2.5983 2.3160 1.0867 1.0812 1.0963 1.0980 1.1939 1.3462 1.7553 7.5016 7.0844 1.0703 1.0691 1.0687 1.0668 1.0668 1.0748 1.0762 1.0904 1.0904 1.0905 1.0959 1.0977 1.0980 1.0851 1.0897 1.0947 1.1007
irintensity: 0.0606 0.0385 0.5724 6.7293 2.8922 3.3579 0.2634 2.1726 3.0866 7.2486 0.7433 7.9690 4.6042 0.6012 5.5535 8.3474 4.7186 0.7308 3.5432 0.5952 0.2563 7.1002 3.4508 6.7820 0.4357 17.0462 108.1448 11.8605 27.2309 10.6924 1.2725 3.4332 12.8377 6.3625 11.0638 5.4163 0.0099 67.4131 33.7914 12.3935 13.2911 37.5795 23.8021 8.3073 32.9246 48.7667 9.9332 19.0491 31.4158 3.1384 8.8325 5.7039 1.8719 2.4073 69.7494 241.3982 15.0693 2.5418 21.9143 4.7159 8.7955 7.3740 0.3014 5.5903 5.6110 12.4068 5.7131 7.5900 11.8078 4.6364 3.3892 1.1034 20.0616 7.5172 17.4507 65.8453 123.4687 25.9709 4.0895 46.7124 81.3726 88.6012 26.8643 101.1937 29.3920 34.4936 22.7742 34.9260 64.0160 38.9787 34.3010 12.1616 1.2060 12.6505 15.4898 15.9679
temp: 298.150 k
press: 1.00000 atm
elementType: 8 8 8 7 6 6 6 6 6 6 6 6 6 6 6 6 6 1 1 1 1 1 1 1 1 1 1 1 1 1 1 1 1 1
symmnumber: 1
zpe: 739403.8 jmol-1
zpe.correction: 0.281624 hartree
zpe.thermalcorrener: 0.296328 hartree
zpe.thermalcorrenthalpy: 0.297272 hartree
zpe.thermalcorrgfe: 0.238539 hartree
zpe.sumelectzpe: -784.665703 hartree
zpe.sumelectthermal: -784.650999 hartree
zpe.sumelectthermalent: -784.650054 hartree
zpe.sumelectthermalfe: -784.708788 hartree
dipole: 0.5314 -0.5307 -0.6239
dipole: 0.9763
quadrupole: -109.2423 -101.3412 -97.4492
quadrupole: 0.1764 -5.6643 0.2696
quadrupole: -6.5647 1.3363 5.2284 0.1764 -5.6643 0.2696
hfenergy: -784.9473267 hartree
pointgroup: C01 [X(C13H17N1O3)]
dipole: 0.2121005 0.2770621 0.1605954 debye
polarizability: 213.9910197|0.3434037|134.1132023|10.5645469|-10.9393505|111.2059788 unknown
InChI: InChI=1S/C13H17NO3/c1-2-4-13-12(3-1)16-10-11(17-13)9-14-5-7-15-8-6-14/h1-4,11H,5-10H2
charge 0 multiplicity 1
34 atoms
O  -1.110767 1.17694 -0.267943
O  5.276209 -0.417357 -0.472113
O  -1.471711 -1.481249 0.902518
N  2.50549 0.269452 0.087562
C  1.272593 1.091286 0.058158
C  0.015014 0.222492 -0.092763
C  2.936649 -0.17473 -1.266904
C  3.629942 0.955692 0.780005
C  -0.25704 -0.666486 1.125281
C  4.162681 -1.09537 -1.154402
C  4.842484 0.014979 0.86669
C  -2.386302 0.57354 -0.149337
C  -2.55943 -0.725844 0.405077
C  -3.504669 1.300559 -0.60516
C  -3.846465 -1.297735 0.467259
C  -4.793956 0.730815 -0.528924
C  -4.963263 -0.573486 -0.002691
H  1.195397 1.650486 1.009759
H  1.275628 1.846636 -0.763938
H  0.06499 -0.414678 -0.99899
H  3.192122 0.702467 -1.912838
H  2.114161 -0.72771 -1.756894
H  3.306769 1.233989 1.800888
H  3.932167 1.890296 0.24489
H  0.565859 -1.379249 1.280696
H  -0.397291 -0.040445 2.029538
H  3.886792 -2.01725 -0.597934
H  4.547573 -1.365794 -2.151353
H  5.712644 0.527881 1.308371
H  4.580493 -0.873737 1.480861
H  -3.342892 2.300057 -1.021378
H  -3.950661 -2.300562 0.893503
H  -5.659284 1.299399 -0.884822
H  -5.960523 -1.022484 0.049228
