program: Gaussian 09
title: 000036858
version: EM64L-G09RevD.01
frameworkgroup: C1[X(C17H14F3N3O3)]
method: RPBEPBE
basis: SDD
operation: Freq
keyword: #p
keyword: freq=noraman
keyword: PBEPBE/SDD
title: #p freq=noraman PBEPBE/SDD
converged: YES YES NO NO
title: Mulliken charges:
elementType: F F F O O O N N N C C C C C C C C C C C C C C C C C H H H H H H H H H H H H H H
charge: -0.168620 -0.167129 -0.164332 -0.228809 -0.269717 -0.203690 -0.267121 -0.085241 -0.035149 0.044205 0.090558 0.430098 0.135421 -0.473930 0.329854 -0.404820 -0.265910 -0.377205 -0.185093 -0.180477 -0.330387 0.245909 -0.362437 0.223117 -0.220539 -0.669369 0.342084 0.286201 0.275249 0.265054 0.236235 0.236138 0.250871 0.261790 0.262298 0.233301 0.232598 0.215760 0.231523 0.231712
chargesum: 0.00000
title: Mulliken charges with hydrogens summed into heavy atoms:
elementType: F F F O O O N N N C C C C C C C C C C C C C C C C C
charge: -0.168620 -0.167129 -0.164332 -0.228809 -0.269717 -0.203690 -0.267121 -0.085241 -0.035149 0.044205 0.090558 0.430098 0.135421 -0.131846 0.329854 -0.118619 0.009339 -0.112151 0.051142 0.055661 -0.079516 0.245909 0.161651 0.223117 0.245359 0.009627
polarizability: 3.02886633e+02 1.30805921e+01 2.84955215e+02 -2.13238633e-01 7.87248421e-01 1.02557389e+02
1716.lowfreq: -0.0012 -0.0008 -0.0003 2.3863 3.6639 5.7219 7.6465 11.9236 18.6476
frequency: 7.2128 11.8611 18.4784 32.6589 36.2941 49.0118 68.5611 76.9447 96.3054 120.9852 129.2712 141.1358 155.1678 172.0446 203.0047 217.3881 239.2389 248.3872 252.2625 275.5016 306.6928 314.9528 342.8245 349.5574 389.4191 400.1869 424.4321 429.6694 436.4306 487.5193 520.2866 554.5226 564.4511 570.4184 573.1204 608.6597 627.7144 645.0008 647.5310 655.1347 697.1857 704.6213 731.4254 756.0102 779.0193 799.1685 804.6130 810.1526 812.3966 850.3290 909.6823 928.3019 945.9133 950.1387 957.3969 983.0550 985.2313 986.6634 986.6929 988.1745 996.5742 1016.6112 1022.0361 1026.8973 1042.3972 1074.2242 1102.8146 1108.6931 1112.8103 1135.1452 1136.6327 1151.4677 1182.5622 1190.6366 1205.1152 1250.5585 1264.4086 1286.2853 1309.9951 1335.5321 1350.3987 1360.2918 1373.2922 1383.4235 1393.5521 1397.8774 1403.5714 1446.4805 1451.0747 1462.7252 1464.5425 1474.1076 1485.4487 1486.9143 1501.7985 1551.1556 1599.4530 1611.4332 1620.6975 1675.6244 2998.0657 3000.8490 3012.7763 3060.2545 3072.5577 3094.8405 3110.2009 3143.8749 3149.6935 3162.6491 3164.0758 3175.2914 3183.3209 3191.7998
redmass: 4.9909 16.6790 6.5337 5.6043 5.8247 2.9366 5.4280 8.1646 3.0382 5.5506 6.8936 2.1089 6.3646 5.2002 8.8321 5.2051 5.4531 1.7453 2.6477 10.6565 7.2790 6.3806 8.0298 4.2749 6.7061 7.8090 4.9169 4.6841 5.1136 4.9111 10.5572 3.1899 7.7462 4.5955 8.5016 12.3045 6.2023 7.6143 7.9691 7.3834 7.1194 2.1788 9.3276 7.8160 3.2866 1.0979 4.6298 1.5424 1.6162 6.3215 6.4899 1.3905 1.3983 6.4317 1.5380 5.6062 5.9589 1.4199 4.8251 2.0326 1.3546 5.9867 2.8196 2.7461 3.9812 3.4643 2.2165 2.1400 2.3296 1.8872 2.2164 1.6354 1.1076 1.0804 3.2163 1.1354 2.5340 2.3752 1.4668 1.5541 4.2000 1.5577 3.2152 2.4299 5.4736 6.0405 1.2729 1.2097 3.2409 3.1349 1.0398 1.0668 2.3297 1.2972 4.2100 7.0335 6.8595 7.8267 6.3358 10.8922 1.0359 1.0569 1.0582 1.1040 1.1069 1.0985 1.1028 1.0897 1.0882 1.0914 1.0940 1.0948 1.0997 1.0958
irintensity: 0.8514 0.0687 0.1778 0.8424 0.2648 0.9413 1.8348 1.5223 1.6100 1.8807 0.0351 16.1311 2.7562 2.2259 1.7431 0.1213 6.3526 0.6904 0.7367 0.1844 0.9040 2.5484 13.3108 10.0089 1.2326 5.3122 0.6550 0.2779 0.1468 1.4373 0.5960 5.7004 8.3143 4.5426 2.3880 22.3877 1.1110 6.0458 5.6849 10.8289 5.3565 26.6429 78.9172 9.1941 30.3257 4.1684 7.1191 3.1232 93.6106 11.4381 3.7237 2.5191 0.5043 14.9055 95.8031 55.7119 38.0400 4.6283 137.1699 4.1072 3.6504 142.7101 76.1554 73.3762 152.2856 69.0890 37.2466 26.0113 30.9123 217.0468 326.3932 10.3313 1.9626 2.9958 6.2798 0.0337 167.0431 158.5386 52.1773 15.4120 48.2379 15.2065 24.4361 84.0672 70.3631 37.8646 16.7168 75.8306 175.6178 1.1269 12.7686 12.9816 89.7545 53.8163 421.3747 62.7577 28.1900 96.6126 77.1804 165.0383 18.1525 26.9832 17.9525 7.1853 7.3168 28.3523 42.6688 10.2601 9.1330 8.3899 19.4106 4.5907 14.8747 2.2139
temp: 298.150 k
press: 1.00000 atm
elementType: 9 9 9 8 8 8 7 7 7 6 6 6 6 6 6 6 6 6 6 6 6 6 6 6 6 6 1 1 1 1 1 1 1 1 1 1 1 1 1 1
symmnumber: 1
zpe: 752043.9 jmol-1
zpe.correction: 0.286438 hartree
zpe.thermalcorrener: 0.309947 hartree
zpe.thermalcorrenthalpy: 0.310892 hartree
zpe.thermalcorrgfe: 0.227590 hartree
zpe.sumelectzpe: -1343.784053 hartree
zpe.sumelectthermal: -1343.760544 hartree
zpe.sumelectthermalent: -1343.759599 hartree
zpe.sumelectthermalfe: -1343.842901 hartree
dipole: 6.2371 -1.2994 -0.2347
dipole: 6.3753
quadrupole: -159.0112 -124.8348 -151.6759
quadrupole: -17.2079 0.1689 -0.4604
quadrupole: -13.8372 20.3391 -6.5019 -17.2079 0.1689 -0.4604
hfenergy: -1344.0704909 hartree
pointgroup: C01 [X(C17H14F3N3O3)]
dipole: 2.4483439 0.5428782 0.0472764 debye
polarizability: 303.0950579|-12.5734918|284.1953477|-5.8690999|8.6954095|103.1088318 unknown
InChI: InChI=1S/C17H14F3N3O3/c1-2-25-14(24)10-26-16-13-7-4-8-21-15(13)23(22-16)12-6-3-5-11(9-12)17(18,19)20/h3-9H,2,10H2,1H3
charge 0 multiplicity 1
40 atoms
F  -6.216289 1.802229 0.86876
F  -5.881348 0.757597 -1.111627
F  -5.581263 -0.377682 0.823322
O  2.954592 -0.896839 -0.064561
O  5.656079 1.522412 -0.02555
O  5.706771 -0.800823 -0.295101
N  -0.518099 -0.241264 0.068561
N  0.827246 0.206212 0.046708
N  -1.677165 -2.43025 0.013205
C  -0.570185 -1.640465 0.012964
C  0.786267 -2.110613 -0.046691
C  -1.56098 0.725642 0.136556
C  1.580729 -0.911391 -0.021854
C  -2.917584 0.317576 0.164432
C  -3.92234 1.305701 0.234803
C  -1.225584 2.103716 0.176685
C  1.017935 -3.502046 -0.111127
C  -3.606401 2.683344 0.275947
C  -2.249252 3.068252 0.248328
C  -0.117954 -4.337576 -0.111964
C  -1.423379 -3.766382 -0.049666
C  -5.362769 0.879531 0.212945
C  3.564536 0.439643 -0.037675
C  5.074821 0.259667 -0.136346
C  7.15181 1.57244 -0.121466
C  7.553461 3.034904 0.030922
H  -3.16283 -0.747372 0.139437
H  -0.173375 2.394297 0.155209
H  2.033794 -3.904875 -0.158312
H  -4.401593 3.431227 0.339494
H  -1.985552 4.130068 0.283651
H  -0.015845 -5.425199 -0.159976
H  -2.307518 -4.413049 -0.05016
H  3.196289 1.049577 -0.884223
H  3.300049 0.968881 0.896509
H  7.56827 0.930351 0.675275
H  7.446992 1.148485 -1.098131
H  8.652791 3.127221 -0.034707
H  7.105535 3.65317 -0.765463
H  7.229735 3.434184 1.007091
