program: Gaussian 09
title: 000036726
version: EM64L-G09RevD.01
frameworkgroup: C1[X(C18H19N3O)]
method: RPBEPBE
basis: SDD
operation: Freq
keyword: #p
keyword: freq=noraman
keyword: PBEPBE/SDD
title: #p freq=noraman PBEPBE/SDD
converged: YES YES NO NO
title: Mulliken charges:
elementType: O N N N C C C C C C C C C C C C C C C C C C H H H H H H H H H H H H H H H H H H H
charge: -0.273471 -0.093430 0.017313 -0.043850 0.242066 -0.176515 0.304026 0.397087 -0.020419 -0.361126 -0.385439 -0.260021 -0.365576 -0.314850 -0.416910 -0.271855 -0.243655 -0.244233 -0.609740 -0.614124 -0.193938 -0.364520 0.186457 0.227948 0.214988 0.228672 0.209992 0.256793 0.245119 0.241812 0.263931 0.232305 0.232290 0.188293 0.229299 0.222831 0.224411 0.187666 0.225676 0.231138 0.243562
chargesum: 0.00000
title: Mulliken charges with hydrogens summed into heavy atoms:
elementType: O N N N C C C C C C C C C C C C C C C C C C
charge: -0.273471 -0.093430 0.017313 -0.043850 0.242066 -0.176515 0.304026 0.397087 -0.020419 0.053278 -0.170451 0.178642 -0.108783 -0.069730 -0.175099 -0.007925 -0.011350 -0.011943 0.030682 0.023630 0.037200 -0.120958
polarizability: 2.77530577e+02 -3.71914022e+01 2.84166937e+02 -3.26572820e+01 -9.64461085e+00 1.53460351e+02
1716.lowfreq: -8.5327 -0.0004 -0.0002 0.0005 3.6125 6.1461 9.8833 26.5463 39.5248
frequency: 7.2955 26.3725 39.5149 51.7776 72.0963 79.7108 91.3903 129.3368 142.9728 169.0149 178.9707 206.9595 224.5202 233.3568 262.1127 268.1105 305.2707 328.2262 340.1443 355.7126 385.9086 397.6901 425.0007 448.3068 470.4518 481.3047 492.3711 526.7275 553.1364 587.9640 606.7437 645.6078 671.9015 676.7680 720.9817 732.4646 763.0061 780.5856 803.3611 808.0480 811.2731 823.4068 826.9927 864.2733 881.0757 898.4750 931.8824 947.3224 958.0737 978.3334 988.7565 994.3024 1000.2161 1033.5394 1034.1023 1038.6504 1054.6518 1069.2603 1080.7483 1088.0562 1095.0779 1113.5519 1139.0193 1162.1028 1167.9605 1175.2770 1180.8112 1221.2685 1230.4305 1233.6583 1244.8185 1264.5520 1282.9716 1284.3145 1322.6378 1326.6784 1332.1922 1381.6321 1383.9514 1396.0152 1414.3977 1420.4299 1428.3297 1444.3871 1456.6737 1462.3880 1465.8213 1476.5849 1476.8405 1484.1272 1485.2678 1490.2187 1507.0587 1538.9133 1568.2309 1571.2280 1603.7677 1639.6850 2847.5245 2851.1216 2868.6799 3003.4026 3022.5259 3031.2344 3037.9308 3077.1092 3082.1023 3088.6945 3100.0036 3123.7922 3126.1966 3138.0022 3144.1240 3155.1027 3157.3366 3169.8761 3182.7151
redmass: 2.6486 3.9992 4.8790 4.7939 2.6127 2.5106 4.1635 4.9249 3.7822 4.1057 5.1431 3.8372 1.1092 1.3228 4.0433 3.9694 3.9337 4.7707 5.1847 2.8416 3.5591 3.6464 4.3208 2.9169 3.2258 4.1207 4.0926 5.8989 5.1756 3.0121 5.9670 5.9290 7.7153 5.7928 5.4060 1.6091 2.1022 2.4389 3.5053 1.1690 1.8087 3.3793 2.1792 5.3230 2.0099 3.3333 2.5416 2.0919 1.4655 1.4161 1.4139 5.5787 1.3190 2.1244 1.6969 2.8883 2.2743 1.6357 2.7721 1.6256 1.7816 1.8512 1.4486 1.5710 1.3680 1.3036 1.5757 2.3414 1.8656 1.9503 1.5373 2.4900 1.5601 1.2880 1.3602 3.2863 2.6789 1.5015 6.1906 1.6920 1.9437 1.1463 2.5678 1.1658 2.4764 1.0490 1.0658 1.0698 1.0586 1.0722 2.7259 1.0865 7.3427 6.4870 7.0117 5.7189 6.0914 7.5585 1.0572 1.0652 1.0621 1.0570 1.0725 1.0724 1.0874 1.1072 1.1018 1.1012 1.0865 1.0867 1.0892 1.0892 1.0925 1.0945 1.0927 1.0996 1.0977
irintensity: 0.3909 0.1628 0.2928 0.4962 1.2060 0.9024 1.8906 3.6828 0.4299 2.5457 0.1230 0.2767 1.0050 0.4679 1.3273 3.8959 10.3171 2.8603 1.8441 8.3235 0.4846 1.7730 5.8560 4.7475 15.6218 2.4788 2.2413 9.9955 0.0567 0.2244 11.3934 2.5911 9.0899 1.0466 0.3230 13.0957 36.3406 15.0429 60.0309 5.4616 50.5971 52.4581 17.8579 36.5222 11.9562 39.7092 110.7091 77.1184 9.9605 10.1631 10.8489 86.9744 1.5034 35.0020 28.2254 3.1822 2.1337 4.4109 4.8895 12.3166 5.5340 1.6656 2.9688 3.6879 6.6054 1.4663 8.9760 3.8802 4.9533 2.3144 0.8406 12.5885 3.7425 3.8452 6.9515 7.9694 9.8171 3.7218 5.8689 21.4900 10.0901 2.6614 19.7636 2.0474 13.7249 12.6101 6.5268 27.1639 12.0484 17.6514 10.5344 12.4075 0.3233 15.6172 5.8388 18.6866 1.3811 11.0957 70.3671 78.7425 209.8096 48.2012 42.1248 55.5597 6.6729 20.1534 50.8916 49.7637 9.8900 4.8632 22.8928 9.0250 15.9551 28.3574 18.4898 22.7278 10.3750
temp: 298.150 k
press: 1.00000 atm
elementType: 8 7 7 7 6 6 6 6 6 6 6 6 6 6 6 6 6 6 6 6 6 6 1 1 1 1 1 1 1 1 1 1 1 1 1 1 1 1 1 1 1
symmnumber: 1
zpe: 866546.9 jmol-1
zpe.correction: 0.330050 hartree
zpe.thermalcorrener: 0.350090 hartree
zpe.thermalcorrenthalpy: 0.351034 hartree
zpe.thermalcorrgfe: 0.278579 hartree
zpe.sumelectzpe: -935.128560 hartree
zpe.sumelectthermal: -935.108520 hartree
zpe.sumelectthermalent: -935.107576 hartree
zpe.sumelectthermalfe: -935.180031 hartree
dipole: -1.6602 -1.1108 1.8895
dipole: 2.7496
quadrupole: -110.3750 -125.0707 -127.5273
quadrupole: -10.3979 -7.5416 -0.0134
quadrupole: 10.6160 -4.0797 -6.5363 -10.3979 -7.5416 -0.0134
hfenergy: -935.4586104 hartree
pointgroup: C01 [X(C18H19N3O1)]
dipole: -0.6006663 -0.4952135 0.7511297 debye
polarizability: 283.009485|-37.2666567|277.7372722|-33.8892337|-11.3987614|154.4111077 unknown
InChI: InChI=1S/C18H19N3O/c1-21(2)12-13-22-20-18-15-7-4-3-6-14(15)9-10-17-16(18)8-5-11-19-17/h3-11H,12-13H2,1-2H3
charge 0 multiplicity 1
41 atoms
O  -1.731999 -0.261673 0.145249
N  -5.285988 -1.23896 -0.486226
N  -0.462485 -0.975147 0.057503
N  1.197645 3.576089 -0.302664
C  1.886818 -0.935281 0.171712
C  0.597299 -0.180336 0.170929
C  0.558517 1.296168 0.371819
C  3.013222 -0.554839 -0.630193
C  1.344655 2.204559 -0.412204
C  -4.121454 -0.442039 -0.037219
C  3.080628 0.645908 -1.468403
C  -2.806844 -1.212638 -0.229011
C  1.954316 -2.127219 0.942043
C  2.365087 1.814271 -1.38797
C  4.152932 -1.414674 -0.644545
C  -0.325783 1.851188 1.336429
C  3.099168 -2.947896 0.929504
C  4.207233 -2.590094 0.124333
C  -6.466687 -0.394552 -0.762574
C  -5.613652 -2.358306 0.421533
C  -0.428499 3.246703 1.482592
C  0.337509 4.069779 0.622337
H  -4.210635 -0.11821 1.031418
H  -4.069715 0.474989 -0.652136
H  3.879829 0.624821 -2.222419
H  -2.687154 -1.516738 -1.283934
H  -2.729753 -2.104842 0.418955
H  1.082698 -2.404385 1.542304
H  2.644783 2.63656 -2.056774
H  5.008843 -1.134762 -1.270248
H  -0.934444 1.183903 1.950763
H  3.125589 -3.861433 1.53319
H  5.100962 -3.222762 0.099075
H  -6.865615 0.126634 0.145012
H  -6.20907 0.372849 -1.513542
H  -7.277568 -1.0191 -1.178467
H  -6.460052 -2.932162 0.004682
H  -5.897912 -2.018624 1.450927
H  -4.756737 -3.047184 0.512959
H  -1.101047 3.691197 2.222376
H  0.261961 5.162539 0.670888
