program: Gaussian 09
title: 000036722
version: EM64L-G09RevD.01
frameworkgroup: C1[X(C11H23Cl)]
method: RPBEPBE
basis: SDD
operation: Freq
keyword: #p
keyword: freq=noraman
keyword: PBEPBE/SDD
title: #p freq=noraman PBEPBE/SDD
converged: YES YES NO NO
title: Mulliken charges:
elementType: Cl C C C C C C C C C C C H H H H H H H H H H H H H H H H H H H H H H H
charge: -0.115770 -0.362725 -0.347237 -0.369062 -0.351745 -0.372076 -0.343874 -0.356313 -0.355218 -0.357016 -0.697272 -0.696266 0.230056 0.192314 0.257870 0.187479 0.223371 0.225781 0.189489 0.185466 0.194135 0.218745 0.183195 0.193505 0.187704 0.199148 0.190693 0.193716 0.195916 0.215823 0.214603 0.209612 0.209590 0.211082 0.215284
chargesum: 0.00000
title: Mulliken charges with hydrogens summed into heavy atoms:
elementType: Cl C C C C C C C C C C C
charge: -0.115770 0.059645 -0.089367 0.041788 0.063525 0.007525 0.058067 0.024895 0.034623 0.032616 -0.057236 -0.060310
polarizability: 1.63240635e+02 -7.87585709e-01 1.21236333e+02 1.95499922e-01 -1.01473164e-01 1.04461659e+02
1716.lowfreq: -13.0991 -3.5032 -0.0020 -0.0018 0.0009 5.6282 22.5799 39.7949 43.4457
frequency: 21.8239 39.7431 42.2634 54.2800 62.0809 97.0168 108.6419 113.5686 131.3286 148.7842 184.3736 195.5387 226.6118 228.5453 249.1486 280.8057 357.2116 386.8316 413.0106 495.0341 516.1888 541.9661 721.7713 724.6981 736.2950 772.6020 797.5796 871.2234 885.9134 893.0156 914.2548 969.9215 983.4055 1000.4609 1026.5620 1044.6352 1045.6803 1071.3207 1077.9862 1085.8759 1096.0398 1103.2988 1130.1708 1134.4101 1189.9121 1198.7168 1217.1086 1230.0772 1243.8267 1255.3909 1273.4664 1276.8325 1284.9137 1288.1313 1291.8005 1303.0739 1306.1005 1332.3046 1345.9343 1354.5898 1359.5489 1361.4003 1388.4638 1390.4808 1435.2576 1447.7646 1462.2305 1464.1315 1466.2790 1472.5862 1475.8612 1476.8443 1477.1089 1481.1938 1487.3148 1487.9895 2947.2066 2949.7019 2954.6040 2956.3628 2960.4885 2964.3366 2967.8916 2968.5137 2971.6867 2973.4924 2987.9960 3003.4315 3005.5214 3015.3522 3016.2214 3028.5025 3040.1940 3046.9471 3055.3127 3068.4918 3070.0658 3070.4064 3072.7465
redmass: 3.2571 2.6437 1.5852 2.4289 2.9641 3.2261 2.8614 1.7575 2.3759 2.3279 2.9183 3.6238 1.1942 1.1210 2.9224 3.1656 3.0328 3.3675 2.8658 2.7745 3.1800 3.6466 1.0784 1.0776 1.1123 1.1938 1.2176 1.2615 1.9250 1.8417 1.2775 1.4869 2.9407 3.2084 2.4717 3.2074 1.3428 2.3645 2.3116 1.9809 1.6077 1.8092 2.2691 2.6205 1.6516 1.5187 1.2933 1.3362 1.2947 1.2648 1.2721 1.1652 1.0865 1.0544 1.1313 1.2947 1.1127 1.4114 1.5060 1.6661 1.6804 1.6551 1.2177 1.2173 1.0809 1.0778 1.0689 1.0756 1.0694 1.0740 1.0663 1.0426 1.0441 1.0797 1.0805 1.0884 1.0624 1.0601 1.0591 1.0621 1.0599 1.0624 1.0620 1.0632 1.0363 1.0362 1.0963 1.0994 1.0957 1.0930 1.0943 1.1029 1.0957 1.1023 1.0976 1.1007 1.1005 1.0993 1.0995
irintensity: 0.0823 0.0848 0.0180 0.3587 0.4904 0.7546 0.0700 0.0801 0.6058 0.4119 0.4219 0.0500 0.1768 0.0087 0.9154 0.9575 4.5811 1.4379 0.2971 0.3896 0.8870 23.5657 0.2908 23.5686 2.4277 1.7947 7.9947 0.9705 2.3145 6.0976 9.7359 9.5828 2.0053 1.3589 8.2861 0.5744 0.5646 2.4479 1.5792 0.3358 8.2684 9.6717 5.9921 2.7140 1.0313 1.2536 12.3905 8.1023 3.1180 3.0279 1.8971 0.7146 2.1622 0.2757 1.1889 0.4709 6.9074 0.7711 2.2269 1.6338 1.0505 2.5217 10.9814 11.7015 0.3760 6.3129 0.0602 0.5380 0.5404 1.4964 4.2912 12.1703 12.3197 3.2030 14.5769 25.4276 3.3474 3.3903 4.6548 29.6385 9.8707 2.1956 16.6845 184.6018 40.8444 37.8730 4.9119 2.5471 11.4919 3.5886 0.7341 25.5674 25.8961 6.5511 101.6937 92.8913 98.4292 53.9528 55.5184
temp: 298.150 k
press: 1.00000 atm
elementType: 17 6 6 6 6 6 6 6 6 6 6 6 1 1 1 1 1 1 1 1 1 1 1 1 1 1 1 1 1 1 1 1 1 1 1
symmnumber: 1
zpe: 829036.2 jmol-1
zpe.correction: 0.315763 hartree
zpe.thermalcorrener: 0.332441 hartree
zpe.thermalcorrenthalpy: 0.333385 hartree
zpe.thermalcorrgfe: 0.268797 hartree
zpe.sumelectzpe: -892.022367 hartree
zpe.sumelectthermal: -892.005690 hartree
zpe.sumelectthermalent: -892.004745 hartree
zpe.sumelectthermalfe: -892.069333 hartree
dipole: -0.1607 -2.4751 0.3072
dipole: 2.4993
quadrupole: -84.4757 -88.7013 -84.2864
quadrupole: -2.9745 0.4149 -0.4266
quadrupole: 1.3454 -2.8801 1.5347 -2.9745 0.4149 -0.4266
hfenergy: -892.3381305 hartree
pointgroup: C01 [X(C11H23Cl1)]
dipole: 0.0483025 0.9195393 0.3449027 debye
polarizability: 163.2553087|-0.1792794|120.2672812|0.0294528|3.8863548|105.4160371 unknown
InChI: InChI=1S/C11H23Cl/c1-3-5-7-8-10-11(12)9-6-4-2/h11H,3-10H2,1-2H3
charge 0 multiplicity 1
35 atoms
Cl -1.261626 -2.003118 -0.771479
C  0.114728 0.4162 -0.322418
C  -1.190401 -0.274606 0.091218
C  1.405746 -0.288229 0.145173
C  -2.462153 0.498113 -0.28087
C  2.681121 0.498777 -0.231752
C  -3.777791 -0.116839 0.241262
C  3.981629 -0.195519 0.230955
C  -5.016805 0.730993 -0.126591
C  5.259639 0.591077 -0.139882
C  -6.334214 0.120963 0.398055
C  6.554407 -0.107613 0.328381
H  0.124777 0.538925 -1.423287
H  0.084958 1.440879 0.109078
H  -1.18144 -0.550278 1.161046
H  1.371353 -0.427493 1.246161
H  1.447526 -1.300916 -0.299598
H  -2.505007 0.610617 -1.382131
H  -2.349846 1.52265 0.137181
H  2.633693 1.517021 0.209401
H  2.713234 0.638036 -1.3327
H  -3.891368 -1.137559 -0.171805
H  -3.72228 -0.226462 1.344775
H  4.034479 -1.210495 -0.215066
H  3.94949 -0.341637 1.331124
H  -5.070714 0.835457 -1.22949
H  -4.896242 1.75723 0.277913
H  5.204216 1.606135 0.304455
H  5.29228 0.734903 -1.239279
H  -7.206825 0.739793 0.119386
H  -6.492223 -0.89291 -0.01518
H  -6.319557 0.033891 1.500965
H  6.559895 -0.236154 1.427374
H  6.649021 -1.11201 -0.125938
H  7.4529 0.474278 0.051763
