program: Gaussian 09
title: 000036718
version: EM64L-G09RevD.01
frameworkgroup: C1[X(C12H18O4)]
method: RPBEPBE
basis: SDD
operation: Freq
keyword: #pfreq=noraman
keyword: PBEPBE/SDD
title: #p freq=noraman PBEPBE/SDD
converged: YES YES NO NO
title: Mulliken charges:
elementType: O O O O C C C C C C C C C C C C H H H H H H H H H H H H H H H H H H
charge: -0.450270 -0.355846 -0.314845 -0.220058 -0.027123 -0.444084 -0.513484 -0.367312 -0.088208 0.326105 -0.354110 -0.497600 -0.497943 0.146932 0.001900 -0.698248 0.169518 0.214389 0.244832 0.274143 0.232552 0.211895 0.203373 0.179779 0.235389 0.260189 0.260893 0.257987 0.258607 0.214777 0.214918 0.206820 0.332881 0.381252
chargesum: 0.00000
title: Mulliken charges with hydrogens summed into heavy atoms:
elementType: O O O O C C C C C C C C C C C C
charge: -0.117389 0.025405 -0.314845 -0.220058 0.142395 0.015137 -0.006789 0.047956 -0.088208 0.326105 0.061058 0.023481 0.018651 0.146932 0.001900 -0.061732
polarizability: 1.96680228e+02 -3.66550862e+00 1.51482446e+02 -4.69412938e+00 5.44069163e+00 1.01614386e+02
1716.lowfreq: -0.0005 -0.0005 -0.0003 3.0922 7.6370 8.8214 16.2460 20.2653 45.2338
frequency: 14.8949 20.0053 45.2260 62.8315 74.3696 91.4064 108.6246 124.6913 172.6600 180.9548 193.7677 204.6851 227.8381 235.2644 307.2932 321.3949 337.3332 365.7581 405.9357 460.2156 465.2373 487.0363 533.7155 544.9981 565.0403 580.3840 645.8506 663.1973 733.0535 737.5387 777.2068 828.5854 833.4445 883.8185 926.7437 945.3783 966.4128 989.9873 1001.5830 1006.7055 1013.3147 1033.4621 1063.6652 1073.6601 1091.1316 1105.4456 1114.6295 1131.7063 1160.4561 1192.5161 1200.0376 1207.7680 1242.9340 1252.1516 1265.1915 1268.4204 1272.8661 1286.4390 1292.9531 1296.6729 1322.6366 1334.1472 1338.4738 1357.0586 1385.5749 1392.4231 1401.3343 1435.9216 1440.7377 1448.9743 1449.7254 1463.7869 1474.1804 1479.1231 1485.7620 1559.0297 1617.0982 1630.8861 2258.6699 2916.7540 2968.1630 2972.1321 2981.6961 2985.1771 3010.7693 3012.3780 3024.8903 3030.2462 3049.9025 3055.6089 3063.1400 3072.1419 3073.5865 3083.4461 3090.9320 3552.5148
redmass: 3.7936 5.2495 4.1858 1.8664 3.6083 1.9762 2.9199 4.6997 2.3328 6.6393 3.8168 3.7712 7.1209 1.1591 1.1171 3.2104 3.8001 4.8459 3.2775 3.3432 3.2540 4.8555 3.4007 5.0280 3.3949 3.0920 5.8332 4.1930 1.6365 2.0429 1.3214 1.6065 1.8134 1.6897 2.2256 3.6150 2.7651 2.3083 3.6648 3.1558 3.4531 2.3003 2.2612 2.4155 1.6043 1.0958 1.7334 1.2522 2.0316 1.9302 1.1183 1.3977 1.5960 1.2928 1.3588 1.3362 1.7216 1.4851 1.9417 1.2090 1.2453 2.1465 1.7631 1.4539 1.5760 1.4092 2.3722 1.1082 1.1351 1.1071 1.1053 1.0978 1.0532 1.0453 1.0773 8.1030 3.7631 3.2707 1.0947 1.0835 1.0623 1.0389 1.0612 1.0601 1.0588 1.0594 1.0630 1.0943 1.1013 1.0992 1.1018 1.0991 1.1010 1.1012 1.1041 1.0661
irintensity: 0.1904 0.1190 1.1752 0.1278 0.6693 1.5051 1.7573 8.0549 3.4041 0.0518 2.0803 1.7392 0.3635 1.6570 163.3664 11.0550 19.5609 7.9715 4.3011 1.7992 7.2136 23.7139 0.3791 6.4078 2.6203 4.9645 33.7712 2.3073 2.6908 1.6973 1.7186 24.2776 2.1672 3.3774 21.4033 27.1355 112.4104 3.6413 33.1670 7.5947 4.6383 15.0833 14.5173 17.6475 1.8614 124.8813 8.6531 0.7423 47.5861 65.5639 0.0327 22.2104 21.2120 31.1048 22.5915 15.4571 14.0638 11.6172 3.8878 0.8525 43.2842 3.5034 6.7259 1.7785 98.9605 49.5286 83.1008 2.4554 33.3125 38.5333 17.9489 13.0811 3.7513 10.9826 12.1985 444.9555 113.5491 578.1773 436.9740 54.2385 34.9147 32.0012 24.1679 34.7054 12.6013 14.5368 4.3784 5.9718 3.6583 17.3643 0.4433 56.5299 89.6486 10.4664 7.5965 11.3523
temp: 298.150 k
press: 1.00000 atm
elementType: 8 8 8 8 6 6 6 6 6 6 6 6 6 6 6 6 1 1 1 1 1 1 1 1 1 1 1 1 1 1 1 1 1 1
symmnumber: 1
zpe: 734839.1 jmol-1
zpe.correction: 0.279885 hartree
zpe.thermalcorrener: 0.297284 hartree
zpe.thermalcorrenthalpy: 0.298228 hartree
zpe.thermalcorrgfe: 0.231904 hartree
zpe.sumelectzpe: -767.734273 hartree
zpe.sumelectthermal: -767.716875 hartree
zpe.sumelectthermalent: -767.715931 hartree
zpe.sumelectthermalfe: -767.782255 hartree
dipole: -1.5395 -0.1484 -0.3095
dipole: 1.5773
quadrupole: -99.2075 -98.0517 -95.6587
quadrupole: -14.9569 -6.4209 -0.6667
quadrupole: -1.5682 -0.4124 1.9806 -14.9569 -6.4209 -0.6667
hfenergy: -768.0141587 hartree
pointgroup: C01 [X(C12H18O4)]
dipole: 0.6067619 -0.0594704 0.1156434 debye
polarizability: 196.572257|4.1122281|151.8909161|-5.0951114|-3.458571|101.3138875 unknown
InChI: InChI=1S/C12H18O4/c1-2-3-8(13)4-5-9(14)12-10(15)6-7-11(12)16/h8,13-14H,2-7H2,1H3
charge 0 multiplicity 1
34 atoms
O  -3.419585 -1.503767 -1.504634
O  1.63815 -2.225369 0.650087
O  3.893662 -1.328777 -0.002408
O  0.505892 2.077654 0.12489
C  -2.714272 -1.056405 -0.283547
C  -1.185044 -1.103289 -0.523485
C  -0.377766 -0.882075 0.795058
C  -3.251732 0.352274 0.012209
C  1.937135 0.077988 0.166426
C  1.092439 -0.992018 0.540824
C  -4.749928 0.364531 0.388256
C  4.048616 1.138531 -0.452044
C  2.941574 2.226773 -0.392122
C  3.34158 -0.158943 -0.085975
C  1.625788 1.504393 -0.00814
C  -5.282549 1.792089 0.634202
H  -2.966295 -1.738042 0.563098
H  -0.906568 -2.090843 -0.944141
H  -0.91294 -0.329643 -1.26506
H  -0.597104 0.127805 1.1805
H  -0.66983 -1.645956 1.538905
H  -3.084649 0.975619 -0.888275
H  -2.6600 0.808598 0.829752
H  -4.903911 -0.251204 1.29895
H  -5.321722 -0.121569 -0.423545
H  4.876088 1.322082 0.256889
H  4.507325 1.041228 -1.452759
H  2.795855 2.744287 -1.356816
H  3.150869 3.009229 0.358885
H  -6.355077 1.781653 0.902101
H  -5.166092 2.417412 -0.270887
H  -4.732743 2.289323 1.456079
H  -3.157924 -2.438099 -1.707423
H  2.681958 -2.14697 0.405051
