program: Gaussian 09
title: 000036895
version: EM64L-G09RevD.01
frameworkgroup: C1[X(C15H14N3O5S)]
method: RPBEPBE
basis: SDD
operation: Freq
keyword: #p
keyword: freq=noraman
keyword: PBEPBE/SDD
title: #p freq=noraman PBEPBE/SDD
converged: YES YES NO NO
title: Mulliken charges:
elementType: S O O O O O N N N C C C C C C C C C C C C C C C H H H H H H H H H H H H H H
charge: 0.941669 -0.359778 -0.513011 -0.481817 -0.170137 -0.170054 -0.169486 -0.377826 0.033599 -0.364570 0.327998 0.285897 -0.321598 -0.049901 -0.314955 -0.310527 -0.004731 -0.200428 -0.186259 -0.205308 -0.203941 -0.314805 -0.314939 0.404601 0.265985 0.260204 0.260550 0.281103 0.338781 0.371375 0.256145 0.266909 0.259619 0.262111 0.297745 0.292122 0.313921 0.313737
chargesum: 1.00000
title: Mulliken charges with hydrogens summed into heavy atoms:
elementType: S O O O O O N N N C C C C C C C C C C C C C C C
charge: 0.941669 -0.359778 -0.513011 -0.481817 -0.170137 -0.170054 -0.169486 -0.006451 0.033599 0.161619 0.327998 0.285897 0.220055 0.288880 -0.058810 -0.043618 -0.004731 0.059191 0.075852 0.092437 0.088181 -0.000884 -0.001202 0.404601
polarizability: 2.75189213e+02 1.92564452e+01 2.32226930e+02 -3.95864989e+00 9.41903171e+00 1.63152293e+02
1716.lowfreq: -6.8266 -2.2160 -0.0005 0.0012 0.0018 7.7305 14.8768 23.2990 29.9745
frequency: 14.7459 23.1478 29.9434 34.2386 53.7876 63.5389 69.0874 106.4537 111.6666 126.8459 184.4420 208.1043 217.5199 224.4844 233.9290 248.7614 273.7045 290.5588 319.6479 339.4791 371.0661 404.8493 410.0284 415.1985 432.2914 451.0260 477.1446 492.6145 503.9744 518.2978 556.1830 564.6101 576.1514 607.8088 615.2971 651.7256 679.1720 682.9662 691.3628 729.0683 752.4450 762.3036 767.2077 779.4006 808.4185 825.5369 837.2183 845.5901 859.8796 867.6447 875.1239 929.6836 950.2212 955.2980 982.8941 992.5501 994.5992 1001.8619 1002.3289 1014.4890 1036.0235 1048.2307 1084.8962 1087.4339 1107.2995 1124.4880 1161.2899 1172.6550 1181.7069 1206.7321 1208.5724 1240.5063 1252.1384 1272.3113 1283.0235 1307.7104 1328.3393 1350.4835 1368.3746 1378.4582 1388.9102 1412.8857 1425.2536 1426.5816 1436.8176 1446.8435 1457.4646 1463.9588 1493.8882 1540.6474 1575.2227 1605.7605 1618.0447 1632.3904 2978.0109 3027.9810 3060.5634 3116.2639 3159.9103 3167.8104 3168.9305 3169.6155 3178.2723 3189.4324 3189.5371 3191.5523 3273.9431 3583.1700
redmass: 6.5085 6.0521 8.2621 8.2356 6.3318 6.4551 6.1624 6.8199 6.5782 10.1432 5.3031 9.8156 10.4263 4.0515 5.1434 4.2436 3.5729 5.0540 5.9539 7.3178 9.9697 6.3878 2.9053 2.8965 3.1269 4.8803 4.6329 5.3752 7.2259 8.4789 5.9505 3.6501 3.4536 7.1117 2.9881 4.8913 7.9666 1.2311 4.0670 4.2609 4.0563 1.2989 5.0723 9.7288 1.5071 11.6672 3.2400 1.2448 1.4276 1.5314 5.2055 2.4498 14.8913 1.3811 6.5574 1.3848 3.3241 1.3461 1.3678 2.1175 2.2090 2.5044 4.1503 3.4169 1.2830 1.8163 1.2940 1.2493 1.1479 1.3327 6.0020 1.7565 1.4397 1.4789 1.2454 3.1845 1.5521 1.2136 1.3741 4.4970 9.2278 2.9598 4.3138 6.7726 1.0993 2.1104 1.3064 2.0751 2.5363 3.8348 6.1635 8.4540 7.1264 7.0369 1.0636 1.0656 1.0994 1.0992 1.0877 1.0909 1.0909 1.0909 1.0969 1.0959 1.1009 1.0973 1.1027 1.0834
irintensity: 0.0618 0.6665 0.1308 1.6122 1.7980 0.6614 4.7749 7.3272 1.5936 9.8836 0.8990 2.3414 2.1104 17.5698 11.8456 4.4083 5.3176 6.3651 3.4493 1.1932 45.6326 23.3112 0.2820 10.1385 4.3563 22.8043 5.9906 39.4666 1.0500 146.9773 3.5362 1.1672 4.0702 0.0029 23.7128 21.7580 14.1900 122.5313 2.0716 7.7898 8.0932 152.4600 15.6355 53.3541 3.6648 50.5551 57.7700 1.0069 1.0798 55.1192 1.7388 2.2468 60.3286 3.2517 4.0012 11.0100 53.6566 0.0685 0.0298 3.2000 37.2426 2.0027 1.0773 0.9254 11.6314 13.6289 5.1971 7.6833 1.6821 32.7136 161.8833 8.1667 7.8976 25.4192 0.0620 8.3838 10.7117 18.6599 17.1455 10.5764 94.2255 15.7333 12.1894 57.4180 22.5631 13.4212 26.4277 5.6317 5.8553 45.9509 3.4418 0.6202 16.4279 3.6748 6.2430 11.8512 1.4193 1.1847 0.3080 1.7792 4.6004 6.5140 1.8459 11.0000 1.5882 5.1063 34.3056 153.7661
temp: 298.150 k
press: 1.00000 atm
elementType: 16 8 8 8 8 8 7 7 7 6 6 6 6 6 6 6 6 6 6 6 6 6 6 6 1 1 1 1 1 1 1 1 1 1 1 1 1 1
symmnumber: 1
zpe: 726073.2 jmol-1
zpe.correction: 0.276547 hartree
zpe.thermalcorrener: 0.298049 hartree
zpe.thermalcorrenthalpy: 0.298993 hartree
zpe.thermalcorrgfe: 0.222792 hartree
zpe.sumelectzpe: -1516.231099 hartree
zpe.sumelectthermal: -1516.209598 hartree
zpe.sumelectthermalent: -1516.208653 hartree
zpe.sumelectthermalfe: -1516.284854 hartree
dipole: 13.4653 -3.3136 -0.2985
dipole: 13.8702
quadrupole: -102.0860 -115.3876 -123.6978
quadrupole: 6.6548 -3.1656 -2.2342
quadrupole: 11.6378 -1.6638 -9.9740 6.6548 -3.1656 -2.2342
hfenergy: -1516.5076461 hartree
pointgroup: C01 [X(C15H14N3O5S1)]
dipole: 5.4564053 0.0743523 0.0242304 debye
polarizability: 263.410486|25.5257543|243.9382369|-9.4448582|-10.3527502|163.2197128 unknown
InChI: InChI=1S/C15H14N3O5S/c19-18(20)12-5-7-13(8-6-12)24(21,22)23-10-9-17-11-16-14-3-1-2-4-15(14)17/h1-8,11,16H,9-10H2
charge 1 multiplicity 1
38 atoms
S  -0.07077 -0.808427 -0.328352
O  0.364754 -0.807767 1.533301
O  0.514056 -2.211349 -0.914801
O  0.445215 0.588479 -0.956737
O  -6.760812 0.242589 0.096377
O  -6.726084 -2.041068 0.179718
N  3.206671 -0.307339 0.529864
N  3.668046 -0.168614 -1.635809
N  -6.154621 -0.89182 0.095643
C  2.842168 -0.869095 1.857025
C  3.452529 1.064988 0.2498
C  3.747264 1.150178 -1.142782
C  1.517548 -1.658662 1.845799
C  3.338181 -1.014749 -0.626093
C  3.44403 2.2105 1.070189
C  4.040488 2.374684 -1.773191
C  -1.937085 -0.83931 -0.194128
C  3.738333 3.43666 0.442335
C  4.030148 3.518428 -0.95174
C  -2.601637 0.398688 -0.198681
C  -2.564638 -2.093649 -0.106858
C  -4.008992 0.375019 -0.103913
C  -3.97185 -2.105208 -0.015101
C  -4.659878 -0.872974 -0.009404
H  3.660404 -1.520749 2.215218
H  2.752939 -0.020237 2.551456
H  1.550881 -2.529583 1.159187
H  1.320886 -2.038207 2.865211
H  3.187613 -2.084095 -0.734273
H  3.784046 -0.453081 -2.6095
H  3.217335 2.170149 2.138873
H  4.262469 2.442708 -2.841744
H  3.742104 4.353229 1.039558
H  4.250817 4.495126 -1.392177
H  -2.052223 1.340555 -0.286483
H  -1.989849 -3.024091 -0.128528
H  -4.599016 1.295094 -0.101166
H  -4.534469 -3.039901 0.052106
