program: Gaussian 09
title: 000036831
version: EM64L-G09RevD.01
frameworkgroup: C1[X(C18H18N6O5S2)]
method: RPBEPBE
basis: SDD
operation: Freq
keyword: #p
keyword: freq=noraman
keyword: PBEPBE/SDD
title: #p freq=noraman PBEPBE/SDD
converged: YES YES NO NO
title: Mulliken charges:
elementType: S S O O O O O N N N N N N C C C C C C C C C C C C C C C C C C H H H H H H H H H H H H H H H H H H
charge: 0.235055 0.328824 -0.146969 -0.399882 -0.289097 -0.243043 -0.460472 -0.159970 -0.358090 -0.161421 -0.161595 -0.034841 -0.089569 -0.500858 -0.179465 0.116497 0.176612 0.461315 -0.850018 -0.859017 0.177720 0.125093 -0.299587 0.458460 -0.053197 -0.459146 -0.376318 -0.220278 -0.212964 -0.233751 -0.610417 0.327967 0.313154 0.290324 0.362530 0.359341 0.316837 0.313073 0.241765 0.393752 0.369835 0.249479 0.267495 0.230435 0.229575 0.232924 0.256406 0.254848 0.270651
chargesum: 0.00000
title: Mulliken charges with hydrogens summed into heavy atoms:
elementType: S S O O O O O N N N N N N C C C C C C C C C C C C C C C C C C
charge: 0.235055 0.328824 -0.146969 -0.006130 -0.289097 -0.243043 -0.090637 -0.159970 0.001251 -0.161421 -0.161595 -0.034841 -0.089569 -0.172891 0.133689 0.116497 0.176612 0.461315 -0.197164 -0.229108 0.177720 0.125093 -0.057822 0.458460 -0.053197 -0.209667 -0.108823 0.010158 0.016610 -0.000827 0.171489
polarizability: 3.24534267e+02 4.99449856e+01 3.20926580e+02 2.62653860e+01 -2.30419789e+01 2.22243051e+02
1716.lowfreq: -15.0008 -3.7734 0.0012 0.0014 0.0025 2.9432 6.4821 13.2504 21.3611
frequency: -11.8389 13.0930 21.2927 26.2228 34.1033 43.3316 46.3384 58.3943 62.1146 74.6367 84.9813 89.6656 100.3279 114.1442 121.0104 141.1689 152.7966 170.8878 194.2423 195.7905 209.3531 225.0248 230.9337 253.0799 254.0047 277.6524 310.3528 325.1776 334.7073 359.0674 371.9695 402.7676 403.2109 412.5664 436.7649 450.2522 459.7605 475.8673 484.5683 503.6052 528.6953 534.0257 543.2182 570.9341 597.4001 612.9390 614.4958 626.1498 644.4645 650.1622 658.6853 674.6092 677.5182 680.4762 704.9592 709.6704 732.8521 736.4243 745.3780 774.2626 797.1805 835.8755 859.9271 863.2385 869.8007 877.7578 893.3129 921.4858 931.1196 932.2630 958.2869 969.8680 980.8748 989.1707 991.5909 1000.2981 1019.7993 1023.3183 1030.3434 1058.4407 1086.4203 1095.1644 1114.0086 1126.8755 1136.5444 1143.9240 1162.4787 1172.9524 1174.8662 1179.4284 1183.7159 1189.5751 1197.3621 1207.6626 1219.4231 1224.3087 1238.2775 1245.7382 1255.3659 1281.9692 1299.2630 1300.1562 1310.4364 1322.5923 1332.5889 1372.7979 1384.4124 1387.3619 1393.1020 1431.6972 1439.6328 1440.5804 1452.0532 1468.8465 1480.7145 1481.6466 1496.1611 1594.6812 1602.4066 1606.5672 1613.6213 1620.6104 1736.7657 2925.8092 2973.9046 3005.5438 3033.7379 3055.6148 3059.3594 3080.9645 3095.5195 3105.6435 3130.4759 3140.1988 3143.2439 3143.9939 3158.6116 3169.5424 3402.2414 3493.7131 3530.9750
redmass: 5.9762 6.8721 5.5731 8.5110 5.0648 7.1155 5.5972 8.2510 8.8723 9.1451 9.4883 2.5325 1.5827 8.8496 8.7194 6.8780 6.0623 4.5696 5.8535 5.5389 6.1648 3.9136 5.7675 5.8997 6.4231 7.1910 7.0793 6.0103 5.3921 3.3148 7.1313 6.3760 3.1742 4.7804 5.5228 7.9094 4.9744 4.2090 1.7640 3.1827 3.1466 2.9186 4.1686 4.0808 2.5219 6.3211 3.0724 4.7741 11.6351 1.7776 2.3931 6.4168 8.9829 3.7546 2.1710 4.4434 4.5999 3.2759 4.3136 3.6682 6.0393 4.0790 1.2705 2.2322 5.3736 2.2799 3.0462 3.0113 7.2025 1.6339 4.1372 4.9701 1.3800 6.0603 13.0476 1.3407 4.8248 3.6509 3.0390 4.1247 1.6878 2.1005 3.0858 1.3312 9.8466 1.6382 2.7757 1.0998 1.4912 1.2722 1.1976 1.4717 3.4858 1.4513 1.5241 1.3816 1.7586 1.3247 1.3961 1.2671 1.5267 2.2389 6.5831 1.6320 1.3243 1.6764 3.3374 5.3782 5.9059 1.1072 1.1237 2.1475 1.4733 1.0424 1.0705 2.3169 1.9347 6.1247 7.3659 7.1747 6.4440 8.1626 12.8607 1.0817 1.0592 1.0346 1.1035 1.0843 1.0585 1.0896 1.1028 1.0887 1.0862 1.1003 1.0917 1.1082 1.0956 1.1002 1.0641 1.0781 1.0645
irintensity: 1.2329 0.0662 2.0134 0.3072 4.9156 3.1243 1.2037 2.5182 2.1547 0.2950 1.8054 0.5486 0.4153 5.9642 0.5893 5.6816 2.0887 2.5447 4.4238 2.3763 0.4574 4.7269 2.4895 16.6693 4.4955 5.5913 0.7895 21.5783 28.7917 6.7881 18.4895 2.5497 1.0007 4.6823 6.5124 4.3846 9.8488 5.4022 16.8328 81.2134 25.3000 58.5381 13.2126 15.3785 47.3434 0.9898 51.9629 17.3679 0.0318 55.2335 59.5397 7.1423 4.7980 27.1154 52.1982 3.5585 17.9396 24.7688 22.8955 12.0972 12.6005 3.7961 0.3769 2.7482 25.4149 5.4427 9.1379 10.4144 20.8308 23.0786 20.3629 65.2494 0.7526 0.4163 12.6026 1.9935 64.7751 192.3653 86.3201 229.2017 10.0268 82.4631 1.7886 0.6644 37.1315 30.6929 21.4811 5.7592 12.0565 26.3455 8.2981 82.7701 14.3304 2.7654 2.5817 10.4540 26.1938 31.2363 2.8424 54.0611 60.8998 140.5623 43.8328 21.9367 10.8835 105.0772 47.2867 5.3230 253.0800 21.6534 28.4630 11.8998 33.9639 25.4593 38.4432 18.4877 359.7446 0.7062 224.9185 129.6975 42.8518 59.4979 461.0263 29.1370 42.0800 17.6825 46.5790 29.3089 4.7968 12.9643 11.7328 8.4739 0.5305 2.0447 19.0167 0.2234 17.3945 13.0237 55.3492 51.5724 76.8213
temp: 298.150 k
press: 1.00000 atm
elementType: 16 16 8 8 8 8 8 7 7 7 7 7 7 6 6 6 6 6 6 6 6 6 6 6 6 6 6 6 6 6 6 1 1 1 1 1 1 1 1 1 1 1 1 1 1 1 1 1 1
symmnumber: 1
zpe: 924715.4 jmol-1
zpe.correction: 0.352206 hartree
zpe.thermalcorrener: 0.380900 hartree
zpe.thermalcorrenthalpy: 0.381845 hartree
zpe.thermalcorrgfe: 0.289121 hartree
zpe.sumelectzpe: -2195.144183 hartree
zpe.sumelectthermal: -2195.115488 hartree
zpe.sumelectthermalent: -2195.114544 hartree
zpe.sumelectthermalfe: -2195.207267 hartree
dipole: 5.7491 -1.8570 0.9738
dipole: 6.1195
quadrupole: -209.8503 -198.4714 -187.2734
quadrupole: -10.5745 13.8067 16.6811
quadrupole: -11.3186 0.0603 11.2583 -10.5745 13.8067 16.6811
hfenergy: -2195.4963882 hartree
pointgroup: C01 [X(C18H18N6O5S2)]
dipole: -2.2950625 -0.558842 -0.4657751 debye
polarizability: 317.8708009|-52.4177689|322.459842|24.5235154|29.3266109|227.3732555 unknown
InChI: InChI=1S/C18H18N6O5S2/c1-23-18(20-21-22-23)31-8-10-7-30-16-11(15(27)24(16)12(10)17(28)29)19-14(26)13(25)9-5-3-2-4-6-9/h2-6,11,13,16,19,25,28H,7-8H2,1H3
charge 0 multiplicity 1
49 atoms
S  0.436014 0.154668 1.349879
S  -4.340666 0.042977 -0.583428
O  0.826134 -2.79709 -2.02606
O  -1.612946 -4.227126 -0.977327
O  4.789335 -2.125939 0.613665
O  -3.478083 -2.85621 -1.17665
O  6.469869 -0.14332 0.015143
N  -0.144436 -2.292942 0.16876
N  2.899367 -1.037574 -0.215306
N  -4.919336 2.778011 -0.452268
N  -3.724567 2.085192 1.295217
N  -4.698642 3.912874 0.370083
N  -3.981634 3.469547 1.414388
C  0.780762 -1.697095 1.159079
C  1.975749 -2.065116 0.201066
C  0.866319 -2.489193 -0.828482
C  -1.542475 -2.117591 0.131934
C  -2.150365 -1.122121 0.877859
C  -1.39079 -0.146491 1.760898
C  -3.646464 -0.956003 0.927645
C  4.255628 -1.151055 -0.001934
C  -2.319313 -3.054465 -0.729855
C  5.161207 -0.031285 -0.601351
C  4.58221 1.366137 -0.413883
C  -4.319353 1.688869 0.132964
C  3.786843 1.95005 -1.431491
C  4.801159 2.0742 0.792578
C  3.193149 3.218761 -1.23543
C  4.213351 3.342882 0.984707
C  3.40119 3.915449 -0.02365
C  -5.681176 2.886003 -1.697204
H  0.757084 -2.177361 2.148267
H  2.566642 -2.917093 0.578859
H  -1.438405 -0.48064 2.815189
H  -1.882177 0.844214 1.717026
H  2.536876 -0.174434 -0.632935
H  -4.199774 -1.900917 0.844187
H  -3.96325 -0.384531 1.8132
H  5.23289 -0.251456 -1.690693
H  -2.120032 -4.794203 -1.618395
H  6.510189 -1.052661 0.431968
H  3.65361 1.429611 -2.389726
H  5.451409 1.632196 1.553999
H  2.582167 3.664119 -2.02823
H  4.388421 3.888203 1.918845
H  2.944798 4.89944 0.130367
H  -5.037043 2.677195 -2.568324
H  -6.526248 2.176729 -1.692294
H  -6.064198 3.914286 -1.764957
