program: Gaussian 09
title: 000036702
version: EM64L-G09RevD.01
frameworkgroup: C1[X(C2H2Cl3O2P)]
method: RPBEPBE
basis: SDD
operation: Freq
keyword: #p
keyword: freq=noraman
keyword: PBEPBE/SDD
title: #p freq=noraman PBEPBE/SDD
converged: YES YES NO NO
title: Mulliken charges:
elementType: Cl Cl Cl P O O C C H H
charge: -0.144563 -0.131806 -0.023924 0.787758 -0.481448 -0.051996 -0.687167 0.051335 0.343027 0.338784
chargesum: 0.00000
title: Mulliken charges with hydrogens summed into heavy atoms:
elementType: Cl Cl Cl P O O C C
charge: -0.144563 -0.131806 -0.023924 0.787758 -0.481448 -0.051996 -0.005356 0.051335
polarizability: 1.02121760e+02 -4.15591812e-01 8.69052855e+01 5.22597774e-01 2.65318859e+00 6.68733971e+01
1716.lowfreq: -7.4299 -5.0151 -0.0020 0.0004 0.0012 3.7155 32.5054 58.3572 78.9773
frequency: 32.4521 58.3454 78.9733 127.0813 171.8199 178.3732 218.0243 236.9513 290.7904 392.3190 404.6774 430.0209 461.0871 670.9706 723.3347 864.4804 952.9961 1054.3963 1169.0133 1267.8285 1373.9844 1759.5158 3036.7389 3110.1088
redmass: 15.2555 8.9183 16.5953 15.2561 11.9545 7.2433 5.8954 11.5609 18.3060 11.1394 15.5217 18.2116 3.6156 8.5792 7.5007 2.0053 4.0388 10.9318 1.1203 1.3736 1.0743 11.6518 1.0598 1.1021
irintensity: 1.3802 3.5025 2.8784 2.4722 1.5272 3.9208 0.7748 1.9257 23.6267 52.9803 73.6379 138.3828 10.0880 21.3589 62.1167 17.4144 150.5873 72.0357 7.4480 23.0759 38.2917 185.4733 9.7718 9.9380
temp: 298.150 k
press: 1.00000 atm
elementType: 17 17 17 15 8 8 6 6 1 1
symmnumber: 1
zpe: 114029.7 jmol-1
zpe.correction: 0.043432 hartree
zpe.thermalcorrener: 0.053649 hartree
zpe.thermalcorrenthalpy: 0.054593 hartree
zpe.thermalcorrgfe: 0.004865 hartree
zpe.sumelectzpe: -1948.647328 hartree
zpe.sumelectthermal: -1948.637111 hartree
zpe.sumelectthermalent: -1948.636167 hartree
zpe.sumelectthermalfe: -1948.685895 hartree
dipole: 1.2253 -2.5622 -1.9124
dipole: 3.4239
quadrupole: -83.4734 -76.8713 -79.2753
quadrupole: -2.7045 1.3532 -2.3819
quadrupole: -3.6001 3.0020 0.5980 -2.7045 1.3532 -2.3819
hfenergy: -1948.6907599 hartree
pointgroup: C01 [X(C2H2Cl3O2P1)]
dipole: -0.4564211 1.1867595 -0.4448408 debye
dipolederiv: -0.5772416 -0.2233992 0.0442916 -0.3623356 -0.6024614 0.0485209 0.0870297 0.0941186 -0.2405785 -0.2815127 0.0170227 0.0070956 0.0906763 -0.4178045 -0.2470169 0.0769581 -0.337692 -0.6138071 -0.9649007 0.3623822 -0.0613662 0.3610385 -0.3987242 0.0694365 -0.1032873 0.070753 -0.1087556 1.5079785 0.2159276 -0.0908557 0.2321609 1.5909837 0.2214848 -0.1711487 0.2373846 1.5270215 -0.5615242 0.0070887 0.0249233 0.0127205 -0.4898234 0.0091029 0.0340775 0.0242525 -0.5989259 -0.4924135 0.0210534 -0.0014888 0.2339978 -0.9009507 0.1627554 -0.0586909 0.1298968 -0.1809605 -0.2220623 -0.1075459 -0.0230919 -0.3273362 -0.3675165 0.0274633 0.0511686 0.0101837 -0.1818193 1.5816339 -0.3550242 0.0760767 -0.2895569 1.3511434 -0.2761273 0.1199505 -0.2312567 0.1965629 0.0007937 0.0495948 0.0401383 0.0148337 0.1146985 -0.0289847 -0.0442319 -0.0095248 0.1195322 0.0092488 0.0128999 -0.015723 0.0338009 0.1204553 0.0133652 0.0081744 0.0118841 0.0817303 unknown
polarizability: 101.9511044|-0.7440848|86.9354001|-2.1537939|2.771268|67.013938 unknown
InChI: InChI=1S/C2H2ClO2P.2Cl/c3-2(4)1-6-5;;/h1H2;;
charge 0 multiplicity 1
10 atoms
Cl 2.654865 1.668357 -0.224544
Cl 1.446036 -1.331756 -1.612303
Cl -3.154562 1.0149 -0.212089
P  1.251551 -0.051427 0.222821
O  1.480509 -0.771142 1.61096
O  -1.689158 -1.253955 0.249391
C  -0.392828 0.839475 -0.054231
C  -1.611797 -0.05328 0.045819
H  -0.454951 1.644199 0.700537
H  -0.346165 1.31303 -1.049162
